{"text_format":"1","workbook":"xlsx","n_sheets":3,"sheets":["Eingabe - Diagramm","Dropdown-Daten","Berechnungen"],"not_rendered":{"charts":2,"images":1,"macros":1,"external_links":0,"defined_names":15,"comments":1,"pivot_tables":0},"unopened":[],"bounds":{"document_bytes":16777216,"sheet_cells":100000,"rows_first":2000,"rows_last":500,"rows_between":2000,"halvings":0,"cell_chars":16384,"cell_head_chars":4096},"cells_cut":0,"cells_raw":0,"read":"whole","date_system":"1900"}

{"sheet":"Eingabe - Diagramm","index":0,"n_rows":57,"n_cols":12,"rows_kept":57,"cut":false,"hidden":false,"merged":[[12,1,13,1],[50,1,51,1],[1,1,1,10],[1,11,1,12]]}
[]
[null,"Kanton St.Gallen\nSicherheits- und Justizdepartement\n\nStrassenverkehrs- und Schifffahrtsamt\nUnfallanalysen"]
[null,"Beurteilung von Abstandsmessungen durch die Polizei:"]
[]
[null,"Eingaben:"]
[]
[null,"Fahrzeug vorne:",null,null,null,null,null,"Fahrzeug hinten:"]
[]
[null,"Geschwindigkeit:",null,null,null,null,null,"Abstand:"]
[null,"Fahrzeugart:",null,null,null,null,null,"Fahrzeugart:"]
[null,"Betriebsgewicht:",null,null,1000,"kg",null,"Betriebsgewicht:",null,null,1000,"kg"]
[]
[null,"Fahrbahnzustand:"]
[]
[null,null,null,null,null,"Reaktionszeit: (für beide Fahrzeuglenker gleich)",null,null,null,null,1,"s"]
[]
[null,{"$f":"IF(Berechnungen!R89=TRUE,\"Kein Aufprall!\",\"Zusammenstoss!\")","v":"Kein Aufprall!"}]
[]
[]
[]
[]
[null,"Resultate:",null,null,null,"entspricht Abstandszeit:",null,null,null,{"$f":"('Dropdown-Daten'!H51/('Dropdown-Daten'!H50/3.6))","v":1.8635294117647059},"s"]
[]
[]
[]
[]
[]
[]
[]
[]
[]
[]
[]
[]
[]
[]
[]
[]
[]
[]
{"$rows_left_out":18}
{"sheet":"Dropdown-Daten","index":1,"n_rows":66,"n_cols":15,"rows_kept":66,"cut":false,"hidden":true,"merged":[]}
[null,30,null,2,null,"Personenwagen ",null,"Trocken"]
[null,35,null,4,null,"Lieferwagen",null,"Nass"]
[null,40,null,6,null,"Lastwagen"]
[null,45,null,8]
[null,50,null,10]
[null,55,null,12]
[null,60,null,14]
[null,65,null,16]
[null,70,null,18]
[null,75,null,20]
[null,80,null,22]
[null,85,null,24]
[null,90,null,26]
[null,95,null,28]
[null,100,null,30]
[null,105,null,32]
[null,110,null,34]
[null,115,null,36]
[null,120,null,38]
[null,125,null,40]
[null,130,null,42]
[null,135,null,44]
[null,140,null,46]
[null,145,null,48]
[null,150,null,50]
[null,155,null,52]
[null,160,null,54]
[null,165,null,56]
[null,170,null,58]
[null,175,null,60]
[null,180,null,62]
[null,null,null,64]
[null,null,null,66]
[null,null,null,68]
[null,null,null,70]
[]
[]
[]
[]
[]
{"$rows_left_out":27}
{"sheet":"Berechnungen","index":2,"n_rows":175,"n_cols":22,"rows_kept":175,"cut":false,"hidden":true,"merged":[]}
[null,"Berechnungsdaten"]
[]
[null,"Fahrzeug 1 (vorne)",null,null,null,null,"Fahrzeug 2 (hinten)"]
[null,null,null,null,null,null,null,null,null,null,null,null,null,null,"Aufprallgeschwindigkeit Fahrz. 1",null,null,"Aufprallgeschwindigkeit Fahrz. 2"]
[null,"v [km/h]","Weg [m]",null,"Zeit [s]","Abstand [m]","v [km/h]","Weg [m]"]
[null,{"$f":"'Dropdown-Daten'!$H$50","v":85},0,null,0,{"$f":"'Dropdown-Daten'!$H$51","v":44},{"$f":"IF('Eingabe - Diagramm'!$K$15>=E6,'Dropdown-Daten'!$H$50,(('Dropdown-Daten'!$H$50/3.6)-('Dropdown-Daten'!$O$66*(E6-'Eingabe - Diagramm'!$K$15)))*3.6)","v":85},{"$f":"-'Dropdown-Daten'!H51","v":-44},null,null,{"$f":"IF(G6>0,H6,K5)","v":-44},null,null,{"$f":"IF(O6=FALSE,6)","v":6},{"$f":"AND(F6<0)","v":false},{"$f":"AND(O6=TRUE)","v":false},{"$f":"IF(P6,B6,\"\")","v":""},{"$f":"AND(O6=TRUE)","v":false},{"$f":"IF(R6=TRUE,G6,\"\")","v":""},null,{"$f":"IF(P6=TRUE,E5,\"\")","v":""},{"$f":"IF(P6=TRUE,H5,\"\")","v":""}]
[null,{"$f":"IF(((B$6/3.6)-('Dropdown-Daten'!$O$55*E7))*3.6>0,((B$6/3.6)-('Dropdown-Daten'!$O$55*E7))*3.6,0)","v":83.02},{"$f":"IF(B7=0,C6,(E7/2*(B7/3.6+'Dropdown-Daten'!$H$50/3.6)))","v":2.3336111111111109},null,0.1,{"$f":"C7-H7","v":43.972499999999997},{"$f":"IF('Eingabe - Diagramm'!$K$15>=E7,'Dropdown-Daten'!$H$50,(('Dropdown-Daten'!$H$50/3.6)-('Dropdown-Daten'!$O$66*(E7-'Eingabe - Diagramm'!$K$15)))*3.6)","v":85},{"$f":"IF(G7>0,L7,H6)","v":-41.638888888888886},null,null,{"$f":"IF(G7>0,H7,K6)","v":-41.638888888888886},{"$f":"IF('Eingabe - Diagramm'!$K$15>=E7,E7*(G7/3.6)+H$6,(G7/3.6+G6/3.6)/2*(E7-E6)+H6)","v":-41.638888888888886},null,{"$f":"IF(O7=FALSE,N6+1)","v":7},{"$f":"AND(F7<0)","v":false},{"$f":"AND(O7=TRUE,O6=FALSE)","v":false},{"$f":"IF(P7,B7,\"\")","v":""},{"$f":"AND(O7=TRUE,O6=FALSE)","v":false},{"$f":"IF(R7=TRUE,G7,\"\")","v":""},null,"",""]
[null,{"$f":"IF(((B$6/3.6)-('Dropdown-Daten'!$O$55*E8))*3.6>0,((B$6/3.6)-('Dropdown-Daten'!$O$55*E8))*3.6,0)","v":81.039999999999992},{"$f":"IF(B8=0,C7,(E8/2*(B8/3.6+'Dropdown-Daten'!$H$50/3.6)))","v":4.612222222222222},null,0.2,{"$f":"C8-H8","v":43.89},{"$f":"IF('Eingabe - Diagramm'!$K$15>=E8,'Dropdown-Daten'!$H$50,(('Dropdown-Daten'!$H$50/3.6)-('Dropdown-Daten'!$O$66*(E8-'Eingabe - Diagramm'!$K$15)))*3.6)","v":85},{"$f":"IF(G8>0,L8,H7)","v":-39.277777777777779},null,null,-39.277777777777779,{"$f":"IF('Eingabe - Diagramm'!$K$15>=E8,E8*(G8/3.6)+H$6,(G8/3.6+G7/3.6)/2*(E8-E7)+H7)","v":-39.277777777777779},null,{"$f":"IF(O8=FALSE,N7+1)","v":8},false,{"$f":"AND(O8=TRUE,O7=FALSE)","v":false},"",{"$f":"AND(O8=TRUE,O7=FALSE)","v":false},"",null,"",""]
[null,{"$f":"IF(((B$6/3.6)-('Dropdown-Daten'!$O$55*E9))*3.6>0,((B$6/3.6)-('Dropdown-Daten'!$O$55*E9))*3.6,0)","v":79.06},{"$f":"IF(B9=0,C8,(E9/2*(B9/3.6+'Dropdown-Daten'!$H$50/3.6)))","v":6.8358333333333334},null,0.3,43.752499999999998,{"$f":"IF('Eingabe - Diagramm'!$K$15>=E9,'Dropdown-Daten'!$H$50,(('Dropdown-Daten'!$H$50/3.6)-('Dropdown-Daten'!$O$66*(E9-'Eingabe - Diagramm'!$K$15)))*3.6)","v":85},-36.916666666666664,null,null,-36.916666666666664,{"$f":"IF('Eingabe - Diagramm'!$K$15>=E9,E9*(G9/3.6)+H$6,(G9/3.6+G8/3.6)/2*(E9-E8)+H8)","v":-36.916666666666664},null,9,false,false,"",false,"",null,"",""]
[null,{"$f":"IF(((B$6/3.6)-('Dropdown-Daten'!$O$55*E10))*3.6>0,((B$6/3.6)-('Dropdown-Daten'!$O$55*E10))*3.6,0)","v":77.08},{"$f":"IF(B10=0,C9,(E10/2*(B10/3.6+'Dropdown-Daten'!$H$50/3.6)))","v":9.0044444444444451},null,0.4,43.56,{"$f":"IF('Eingabe - Diagramm'!$K$15>=E10,'Dropdown-Daten'!$H$50,(('Dropdown-Daten'!$H$50/3.6)-('Dropdown-Daten'!$O$66*(E10-'Eingabe - Diagramm'!$K$15)))*3.6)","v":85},-34.555555555555557,null,null,-34.555555555555557,{"$f":"IF('Eingabe - Diagramm'!$K$15>=E10,E10*(G10/3.6)+H$6,(G10/3.6+G9/3.6)/2*(E10-E9)+H9)","v":-34.555555555555557},null,10,false,false,"",false,"",null,"",""]
[null,{"$f":"IF(((B$6/3.6)-('Dropdown-Daten'!$O$55*E11))*3.6>0,((B$6/3.6)-('Dropdown-Daten'!$O$55*E11))*3.6,0)","v":75.099999999999994},{"$f":"IF(B11=0,C10,(E11/2*(B11/3.6+'Dropdown-Daten'!$H$50/3.6)))","v":11.118055555555555},null,0.5,43.3125,{"$f":"IF('Eingabe - Diagramm'!$K$15>=E11,'Dropdown-Daten'!$H$50,(('Dropdown-Daten'!$H$50/3.6)-('Dropdown-Daten'!$O$66*(E11-'Eingabe - Diagramm'!$K$15)))*3.6)","v":85},-32.194444444444443,null,null,-32.194444444444443,{"$f":"IF('Eingabe - Diagramm'!$K$15>=E11,E11*(G11/3.6)+H$6,(G11/3.6+G10/3.6)/2*(E11-E10)+H10)","v":-32.194444444444443},null,11,false,false,"",false,"",null,"",""]
[null,{"$f":"IF(((B$6/3.6)-('Dropdown-Daten'!$O$55*E12))*3.6>0,((B$6/3.6)-('Dropdown-Daten'!$O$55*E12))*3.6,0)","v":73.12},{"$f":"IF(B12=0,C11,(E12/2*(B12/3.6+'Dropdown-Daten'!$H$50/3.6)))","v":13.176666666666668},null,0.6,43.010000000000005,{"$f":"IF('Eingabe - Diagramm'!$K$15>=E12,'Dropdown-Daten'!$H$50,(('Dropdown-Daten'!$H$50/3.6)-('Dropdown-Daten'!$O$66*(E12-'Eingabe - Diagramm'!$K$15)))*3.6)","v":85},-29.833333333333336,null,null,-29.833333333333336,{"$f":"IF('Eingabe - Diagramm'!$K$15>=E12,E12*(G12/3.6)+H$6,(G12/3.6+G11/3.6)/2*(E12-E11)+H11)","v":-29.833333333333336},null,12,false,false,"",false,"",null,"",""]
[null,{"$f":"IF(((B$6/3.6)-('Dropdown-Daten'!$O$55*E13))*3.6>0,((B$6/3.6)-('Dropdown-Daten'!$O$55*E13))*3.6,0)","v":71.140000000000015},{"$f":"IF(B13=0,C12,(E13/2*(B13/3.6+'Dropdown-Daten'!$H$50/3.6)))","v":15.180277777777778},null,0.7,42.652500000000003,{"$f":"IF('Eingabe - Diagramm'!$K$15>=E13,'Dropdown-Daten'!$H$50,(('Dropdown-Daten'!$H$50/3.6)-('Dropdown-Daten'!$O$66*(E13-'Eingabe - Diagramm'!$K$15)))*3.6)","v":85},-27.472222222222225,null,null,-27.472222222222225,{"$f":"IF('Eingabe - Diagramm'!$K$15>=E13,E13*(G13/3.6)+H$6,(G13/3.6+G12/3.6)/2*(E13-E12)+H12)","v":-27.472222222222225},null,13,false,false,"",false,"",null,"",""]
[null,{"$f":"IF(((B$6/3.6)-('Dropdown-Daten'!$O$55*E14))*3.6>0,((B$6/3.6)-('Dropdown-Daten'!$O$55*E14))*3.6,0)","v":69.16},{"$f":"IF(B14=0,C13,(E14/2*(B14/3.6+'Dropdown-Daten'!$H$50/3.6)))","v":17.128888888888891},null,0.8,42.24,{"$f":"IF('Eingabe - Diagramm'!$K$15>=E14,'Dropdown-Daten'!$H$50,(('Dropdown-Daten'!$H$50/3.6)-('Dropdown-Daten'!$O$66*(E14-'Eingabe - Diagramm'!$K$15)))*3.6)","v":85},-25.111111111111111,null,null,-25.111111111111111,{"$f":"IF('Eingabe - Diagramm'!$K$15>=E14,E14*(G14/3.6)+H$6,(G14/3.6+G13/3.6)/2*(E14-E13)+H13)","v":-25.111111111111111},null,14,false,false,"",false,"",null,"",""]
[null,{"$f":"IF(((B$6/3.6)-('Dropdown-Daten'!$O$55*E15))*3.6>0,((B$6/3.6)-('Dropdown-Daten'!$O$55*E15))*3.6,0)","v":67.180000000000007},{"$f":"IF(B15=0,C14,(E15/2*(B15/3.6+'Dropdown-Daten'!$H$50/3.6)))","v":19.022500000000001},null,0.9,41.772500000000001,{"$f":"IF('Eingabe - Diagramm'!$K$15>=E15,'Dropdown-Daten'!$H$50,(('Dropdown-Daten'!$H$50/3.6)-('Dropdown-Daten'!$O$66*(E15-'Eingabe - Diagramm'!$K$15)))*3.6)","v":85},-22.75,null,null,-22.75,{"$f":"IF('Eingabe - Diagramm'!$K$15>=E15,E15*(G15/3.6)+H$6,(G15/3.6+G14/3.6)/2*(E15-E14)+H14)","v":-22.75},null,15,false,false,"",false,"",null,"",""]
[null,{"$f":"IF(((B$6/3.6)-('Dropdown-Daten'!$O$55*E16))*3.6>0,((B$6/3.6)-('Dropdown-Daten'!$O$55*E16))*3.6,0)","v":65.2},{"$f":"IF(B16=0,C15,(E16/2*(B16/3.6+'Dropdown-Daten'!$H$50/3.6)))","v":20.861111111111111},null,1,41.25,{"$f":"IF('Eingabe - Diagramm'!$K$15>=E16,'Dropdown-Daten'!$H$50,(('Dropdown-Daten'!$H$50/3.6)-('Dropdown-Daten'!$O$66*(E16-'Eingabe - Diagramm'!$K$15)))*3.6)","v":85},-20.388888888888889,null,null,-20.388888888888889,{"$f":"IF('Eingabe - Diagramm'!$K$15>=E16,E16*(G16/3.6)+H$6,(G16/3.6+G15/3.6)/2*(E16-E15)+H15)","v":-20.388888888888889},null,16,false,false,"",false,"",null,"",""]
[null,{"$f":"IF(((B$6/3.6)-('Dropdown-Daten'!$O$55*E17))*3.6>0,((B$6/3.6)-('Dropdown-Daten'!$O$55*E17))*3.6,0)","v":63.22},{"$f":"IF(B17=0,C16,(E17/2*(B17/3.6+'Dropdown-Daten'!$H$50/3.6)))","v":22.644722222222221},null,1.1000000000000001,40.704999999999998,{"$f":"IF('Eingabe - Diagramm'!$K$15>=E17,'Dropdown-Daten'!$H$50,(('Dropdown-Daten'!$H$50/3.6)-('Dropdown-Daten'!$O$66*(E17-'Eingabe - Diagramm'!$K$15)))*3.6)","v":82.66},-18.060277777777777,null,null,-18.060277777777777,{"$f":"IF('Eingabe - Diagramm'!$K$15>=E17,E17*(G17/3.6)+H$6,(G17/3.6+G16/3.6)/2*(E17-E16)+H16)","v":-18.060277777777777},null,17,false,false,"",false,"",null,"",""]
[null,{"$f":"IF(((B$6/3.6)-('Dropdown-Daten'!$O$55*E18))*3.6>0,((B$6/3.6)-('Dropdown-Daten'!$O$55*E18))*3.6,0)","v":61.240000000000009},{"$f":"IF(B18=0,C17,(E18/2*(B18/3.6+'Dropdown-Daten'!$H$50/3.6)))","v":24.373333333333331},null,1.2,40.17,{"$f":"IF('Eingabe - Diagramm'!$K$15>=E18,'Dropdown-Daten'!$H$50,(('Dropdown-Daten'!$H$50/3.6)-('Dropdown-Daten'!$O$66*(E18-'Eingabe - Diagramm'!$K$15)))*3.6)","v":80.319999999999993},-15.79666666666667,null,null,-15.79666666666667,{"$f":"IF('Eingabe - Diagramm'!$K$15>=E18,E18*(G18/3.6)+H$6,(G18/3.6+G17/3.6)/2*(E18-E17)+H17)","v":-15.79666666666667},null,18,false,false,"",false,"",null,"",""]
[null,{"$f":"IF(((B$6/3.6)-('Dropdown-Daten'!$O$55*E19))*3.6>0,((B$6/3.6)-('Dropdown-Daten'!$O$55*E19))*3.6,0)","v":59.259999999999991},{"$f":"IF(B19=0,C18,(E19/2*(B19/3.6+'Dropdown-Daten'!$H$50/3.6)))","v":26.046944444444446},null,1.3,39.645000000000003,{"$f":"IF('Eingabe - Diagramm'!$K$15>=E19,'Dropdown-Daten'!$H$50,(('Dropdown-Daten'!$H$50/3.6)-('Dropdown-Daten'!$O$66*(E19-'Eingabe - Diagramm'!$K$15)))*3.6)","v":77.98},-13.598055555555558,null,null,-13.598055555555558,{"$f":"IF('Eingabe - Diagramm'!$K$15>=E19,E19*(G19/3.6)+H$6,(G19/3.6+G18/3.6)/2*(E19-E18)+H18)","v":-13.598055555555558},null,19,false,false,"",false,"",null,"",""]
[null,{"$f":"IF(((B$6/3.6)-('Dropdown-Daten'!$O$55*E20))*3.6>0,((B$6/3.6)-('Dropdown-Daten'!$O$55*E20))*3.6,0)","v":57.28},{"$f":"IF(B20=0,C19,(E20/2*(B20/3.6+'Dropdown-Daten'!$H$50/3.6)))","v":27.665555555555557},null,1.4,{"$f":"C20-H20","v":39.13000000000001},{"$f":"IF('Eingabe - Diagramm'!$K$15>=E20,'Dropdown-Daten'!$H$50,(('Dropdown-Daten'!$H$50/3.6)-('Dropdown-Daten'!$O$66*(E20-'Eingabe - Diagramm'!$K$15)))*3.6)","v":75.640000000000015},-11.46444444444445,null,null,-11.46444444444445,{"$f":"IF('Eingabe - Diagramm'!$K$15>=E20,E20*(G20/3.6)+H$6,(G20/3.6+G19/3.6)/2*(E20-E19)+H19)","v":-11.46444444444445},null,20,false,false,"",false,"",null,"",""]
[null,{"$f":"IF(((B$6/3.6)-('Dropdown-Daten'!$O$55*E21))*3.6>0,((B$6/3.6)-('Dropdown-Daten'!$O$55*E21))*3.6,0)","v":55.3},{"$f":"IF(B21=0,C20,(E21/2*(B21/3.6+'Dropdown-Daten'!$H$50/3.6)))","v":29.229166666666664},null,1.5,38.625,{"$f":"IF('Eingabe - Diagramm'!$K$15>=E21,'Dropdown-Daten'!$H$50,(('Dropdown-Daten'!$H$50/3.6)-('Dropdown-Daten'!$O$66*(E21-'Eingabe - Diagramm'!$K$15)))*3.6)","v":73.3},-9.3958333333333357,null,null,-9.3958333333333357,{"$f":"IF('Eingabe - Diagramm'!$K$15>=E21,E21*(G21/3.6)+H$6,(G21/3.6+G20/3.6)/2*(E21-E20)+H20)","v":-9.3958333333333357},null,21,false,false,"",false,"",null,"",""]
[null,{"$f":"IF(((B$6/3.6)-('Dropdown-Daten'!$O$55*E22))*3.6>0,((B$6/3.6)-('Dropdown-Daten'!$O$55*E22))*3.6,0)","v":53.32},{"$f":"IF(B22=0,C21,(E22/2*(B22/3.6+'Dropdown-Daten'!$H$50/3.6)))","v":30.737777777777776},null,1.6,38.129999999999995,{"$f":"IF('Eingabe - Diagramm'!$K$15>=E22,'Dropdown-Daten'!$H$50,(('Dropdown-Daten'!$H$50/3.6)-('Dropdown-Daten'!$O$66*(E22-'Eingabe - Diagramm'!$K$15)))*3.6)","v":70.959999999999994},-7.3922222222222231,null,null,-7.3922222222222231,{"$f":"IF('Eingabe - Diagramm'!$K$15>=E22,E22*(G22/3.6)+H$6,(G22/3.6+G21/3.6)/2*(E22-E21)+H21)","v":-7.3922222222222231},null,22,false,false,"",false,"",null,"",""]
[null,{"$f":"IF(((B$6/3.6)-('Dropdown-Daten'!$O$55*E23))*3.6>0,((B$6/3.6)-('Dropdown-Daten'!$O$55*E23))*3.6,0)","v":51.34},{"$f":"IF(B23=0,C22,(E23/2*(B23/3.6+'Dropdown-Daten'!$H$50/3.6)))","v":32.191388888888888},null,1.7,37.645000000000003,{"$f":"IF('Eingabe - Diagramm'!$K$15>=E23,'Dropdown-Daten'!$H$50,(('Dropdown-Daten'!$H$50/3.6)-('Dropdown-Daten'!$O$66*(E23-'Eingabe - Diagramm'!$K$15)))*3.6)","v":68.62},-5.4536111111111145,null,null,-5.4536111111111145,{"$f":"IF('Eingabe - Diagramm'!$K$15>=E23,E23*(G23/3.6)+H$6,(G23/3.6+G22/3.6)/2*(E23-E22)+H22)","v":-5.4536111111111145},null,23,false,false,"",false,"",null,"",{"$f":"IF(P23=TRUE,H22,\"\")","v":""}]
[null,{"$f":"IF(((B$6/3.6)-('Dropdown-Daten'!$O$55*E24))*3.6>0,((B$6/3.6)-('Dropdown-Daten'!$O$55*E24))*3.6,0)","v":49.36},{"$f":"IF(B24=0,C23,(E24/2*(B24/3.6+'Dropdown-Daten'!$H$50/3.6)))","v":33.590000000000003},null,1.8,37.17,{"$f":"IF('Eingabe - Diagramm'!$K$15>=E24,'Dropdown-Daten'!$H$50,(('Dropdown-Daten'!$H$50/3.6)-('Dropdown-Daten'!$O$66*(E24-'Eingabe - Diagramm'!$K$15)))*3.6)","v":66.28},-3.5800000000000014,null,null,-3.5800000000000014,{"$f":"IF('Eingabe - Diagramm'!$K$15>=E24,E24*(G24/3.6)+H$6,(G24/3.6+G23/3.6)/2*(E24-E23)+H23)","v":-3.5800000000000014},null,24,false,false,"",false,"",null,"",{"$f":"IF(P24=TRUE,H23,\"\")","v":""}]
[null,{"$f":"IF(((B$6/3.6)-('Dropdown-Daten'!$O$55*E25))*3.6>0,((B$6/3.6)-('Dropdown-Daten'!$O$55*E25))*3.6,0)","v":47.38},{"$f":"IF(B25=0,C24,(E25/2*(B25/3.6+'Dropdown-Daten'!$H$50/3.6)))","v":34.933611111111112},null,1.9,36.705000000000005,{"$f":"IF('Eingabe - Diagramm'!$K$15>=E25,'Dropdown-Daten'!$H$50,(('Dropdown-Daten'!$H$50/3.6)-('Dropdown-Daten'!$O$66*(E25-'Eingabe - Diagramm'!$K$15)))*3.6)","v":63.940000000000005},-1.7713888888888927,null,null,-1.7713888888888927,{"$f":"IF('Eingabe - Diagramm'!$K$15>=E25,E25*(G25/3.6)+H$6,(G25/3.6+G24/3.6)/2*(E25-E24)+H24)","v":-1.7713888888888927},null,25,false,false,"",false,"",null,"",""]
[null,{"$f":"IF(((B$6/3.6)-('Dropdown-Daten'!$O$55*E26))*3.6>0,((B$6/3.6)-('Dropdown-Daten'!$O$55*E26))*3.6,0)","v":45.4},{"$f":"IF(B26=0,C25,(E26/2*(B26/3.6+'Dropdown-Daten'!$H$50/3.6)))","v":36.222222222222221},null,2,36.25,{"$f":"IF('Eingabe - Diagramm'!$K$15>=E26,'Dropdown-Daten'!$H$50,(('Dropdown-Daten'!$H$50/3.6)-('Dropdown-Daten'!$O$66*(E26-'Eingabe - Diagramm'!$K$15)))*3.6)","v":61.6},-2.7777777777780122E-2,null,null,-2.7777777777780122E-2,{"$f":"IF('Eingabe - Diagramm'!$K$15>=E26,E26*(G26/3.6)+H$6,(G26/3.6+G25/3.6)/2*(E26-E25)+H25)","v":-2.7777777777780122E-2},null,26,false,{"$f":"AND(O26=TRUE,O25=FALSE)","v":false},"",false,"",null,"",""]
[null,{"$f":"IF(((B$6/3.6)-('Dropdown-Daten'!$O$55*E27))*3.6>0,((B$6/3.6)-('Dropdown-Daten'!$O$55*E27))*3.6,0)","v":43.419999999999995},{"$f":"IF(B27=0,C26,(E27/2*(B27/3.6+'Dropdown-Daten'!$H$50/3.6)))","v":37.455833333333331},null,2.1,35.805,{"$f":"IF('Eingabe - Diagramm'!$K$15>=E27,'Dropdown-Daten'!$H$50,(('Dropdown-Daten'!$H$50/3.6)-('Dropdown-Daten'!$O$66*(E27-'Eingabe - Diagramm'!$K$15)))*3.6)","v":59.259999999999991},1.6508333333333325,null,null,1.6508333333333325,{"$f":"IF('Eingabe - Diagramm'!$K$15>=E27,E27*(G27/3.6)+H$6,(G27/3.6+G26/3.6)/2*(E27-E26)+H26)","v":1.6508333333333325},null,27,false,false,"",false,"",null,"",""]
[null,{"$f":"IF(((B$6/3.6)-('Dropdown-Daten'!$O$55*E28))*3.6>0,((B$6/3.6)-('Dropdown-Daten'!$O$55*E28))*3.6,0)","v":41.44},{"$f":"IF(B28=0,C27,(E28/2*(B28/3.6+'Dropdown-Daten'!$H$50/3.6)))","v":38.634444444444448},null,2.2000000000000002,35.370000000000005,{"$f":"IF('Eingabe - Diagramm'!$K$15>=E28,'Dropdown-Daten'!$H$50,(('Dropdown-Daten'!$H$50/3.6)-('Dropdown-Daten'!$O$66*(E28-'Eingabe - Diagramm'!$K$15)))*3.6)","v":56.919999999999995},3.2644444444444449,null,null,3.2644444444444449,{"$f":"IF('Eingabe - Diagramm'!$K$15>=E28,E28*(G28/3.6)+H$6,(G28/3.6+G27/3.6)/2*(E28-E27)+H27)","v":3.2644444444444449},null,28,false,false,"",false,"",null,"",""]
[null,{"$f":"IF(((B$6/3.6)-('Dropdown-Daten'!$O$55*E29))*3.6>0,((B$6/3.6)-('Dropdown-Daten'!$O$55*E29))*3.6,0)","v":39.460000000000008},{"$f":"IF(B29=0,C28,(E29/2*(B29/3.6+'Dropdown-Daten'!$H$50/3.6)))","v":39.758055555555551},null,2.2999999999999998,34.945,{"$f":"IF('Eingabe - Diagramm'!$K$15>=E29,'Dropdown-Daten'!$H$50,(('Dropdown-Daten'!$H$50/3.6)-('Dropdown-Daten'!$O$66*(E29-'Eingabe - Diagramm'!$K$15)))*3.6)","v":54.580000000000005},4.8130555555555503,null,null,4.8130555555555503,{"$f":"IF('Eingabe - Diagramm'!$K$15>=E29,E29*(G29/3.6)+H$6,(G29/3.6+G28/3.6)/2*(E29-E28)+H28)","v":4.8130555555555503},null,29,false,false,"",false,"",null,"",""]
[null,{"$f":"IF(((B$6/3.6)-('Dropdown-Daten'!$O$55*E30))*3.6>0,((B$6/3.6)-('Dropdown-Daten'!$O$55*E30))*3.6,0)","v":37.480000000000004},{"$f":"IF(B30=0,C29,(E30/2*(B30/3.6+'Dropdown-Daten'!$H$50/3.6)))","v":40.826666666666668},null,2.4,34.53,{"$f":"IF('Eingabe - Diagramm'!$K$15>=E30,'Dropdown-Daten'!$H$50,(('Dropdown-Daten'!$H$50/3.6)-('Dropdown-Daten'!$O$66*(E30-'Eingabe - Diagramm'!$K$15)))*3.6)","v":52.24},6.2966666666666633,null,null,6.2966666666666633,{"$f":"IF('Eingabe - Diagramm'!$K$15>=E30,E30*(G30/3.6)+H$6,(G30/3.6+G29/3.6)/2*(E30-E29)+H29)","v":6.2966666666666633},null,30,false,false,"",false,"",null,"",""]
[null,{"$f":"IF(((B$6/3.6)-('Dropdown-Daten'!$O$55*E31))*3.6>0,((B$6/3.6)-('Dropdown-Daten'!$O$55*E31))*3.6,0)","v":35.5},{"$f":"IF(B31=0,C30,(E31/2*(B31/3.6+'Dropdown-Daten'!$H$50/3.6)))","v":41.840277777777779},null,2.5,34.125,{"$f":"IF('Eingabe - Diagramm'!$K$15>=E31,'Dropdown-Daten'!$H$50,(('Dropdown-Daten'!$H$50/3.6)-('Dropdown-Daten'!$O$66*(E31-'Eingabe - Diagramm'!$K$15)))*3.6)","v":49.9},{"$f":"IF(G31>0,L31,H30)","v":7.715277777777775},null,null,7.715277777777775,{"$f":"IF('Eingabe - Diagramm'!$K$15>=E31,E31*(G31/3.6)+H$6,(G31/3.6+G30/3.6)/2*(E31-E30)+H30)","v":7.715277777777775},null,31,false,false,"",false,"",null,"",""]
[null,{"$f":"IF(((B$6/3.6)-('Dropdown-Daten'!$O$55*E32))*3.6>0,((B$6/3.6)-('Dropdown-Daten'!$O$55*E32))*3.6,0)","v":33.519999999999996},{"$f":"IF(B32=0,C31,(E32/2*(B32/3.6+'Dropdown-Daten'!$H$50/3.6)))","v":42.798888888888882},null,2.6,33.729999999999997,{"$f":"IF('Eingabe - Diagramm'!$K$15>=E32,'Dropdown-Daten'!$H$50,(('Dropdown-Daten'!$H$50/3.6)-('Dropdown-Daten'!$O$66*(E32-'Eingabe - Diagramm'!$K$15)))*3.6)","v":47.559999999999995},9.0688888888888872,null,null,9.0688888888888872,{"$f":"IF('Eingabe - Diagramm'!$K$15>=E32,E32*(G32/3.6)+H$6,(G32/3.6+G31/3.6)/2*(E32-E31)+H31)","v":9.0688888888888872},null,32,false,false,"",false,"",null,"",""]
[null,{"$f":"IF(((B$6/3.6)-('Dropdown-Daten'!$O$55*E33))*3.6>0,((B$6/3.6)-('Dropdown-Daten'!$O$55*E33))*3.6,0)","v":31.539999999999996},{"$f":"IF(B33=0,C32,(E33/2*(B33/3.6+'Dropdown-Daten'!$H$50/3.6)))","v":43.702500000000001},null,2.7,33.344999999999999,{"$f":"IF('Eingabe - Diagramm'!$K$15>=E33,'Dropdown-Daten'!$H$50,(('Dropdown-Daten'!$H$50/3.6)-('Dropdown-Daten'!$O$66*(E33-'Eingabe - Diagramm'!$K$15)))*3.6)","v":45.22},10.3575,null,null,10.3575,{"$f":"IF('Eingabe - Diagramm'!$K$15>=E33,E33*(G33/3.6)+H$6,(G33/3.6+G32/3.6)/2*(E33-E32)+H32)","v":10.3575},null,33,false,false,"",false,"",null,"",""]
[null,{"$f":"IF(((B$6/3.6)-('Dropdown-Daten'!$O$55*E34))*3.6>0,((B$6/3.6)-('Dropdown-Daten'!$O$55*E34))*3.6,0)","v":29.560000000000006},{"$f":"IF(B34=0,C33,(E34/2*(B34/3.6+'Dropdown-Daten'!$H$50/3.6)))","v":44.551111111111112},null,2.8,32.970000000000006,{"$f":"IF('Eingabe - Diagramm'!$K$15>=E34,'Dropdown-Daten'!$H$50,(('Dropdown-Daten'!$H$50/3.6)-('Dropdown-Daten'!$O$66*(E34-'Eingabe - Diagramm'!$K$15)))*3.6)","v":42.88},11.581111111111106,null,null,11.581111111111106,{"$f":"IF('Eingabe - Diagramm'!$K$15>=E34,E34*(G34/3.6)+H$6,(G34/3.6+G33/3.6)/2*(E34-E33)+H33)","v":11.581111111111106},null,34,false,false,"",false,"",null,"",""]
[null,{"$f":"IF(((B$6/3.6)-('Dropdown-Daten'!$O$55*E35))*3.6>0,((B$6/3.6)-('Dropdown-Daten'!$O$55*E35))*3.6,0)","v":27.580000000000002},{"$f":"IF(B35=0,C34,(E35/2*(B35/3.6+'Dropdown-Daten'!$H$50/3.6)))","v":45.344722222222224},null,2.9,32.605000000000004,{"$f":"IF('Eingabe - Diagramm'!$K$15>=E35,'Dropdown-Daten'!$H$50,(('Dropdown-Daten'!$H$50/3.6)-('Dropdown-Daten'!$O$66*(E35-'Eingabe - Diagramm'!$K$15)))*3.6)","v":40.54},12.739722222222218,null,null,12.739722222222218,{"$f":"IF('Eingabe - Diagramm'!$K$15>=E35,E35*(G35/3.6)+H$6,(G35/3.6+G34/3.6)/2*(E35-E34)+H34)","v":12.739722222222218},null,35,false,false,"",{"$f":"AND(O35=TRUE,O34=FALSE)","v":false},"",null,"",""]
[null,{"$f":"IF(((B$6/3.6)-('Dropdown-Daten'!$O$55*E36))*3.6>0,((B$6/3.6)-('Dropdown-Daten'!$O$55*E36))*3.6,0)","v":25.599999999999998},{"$f":"IF(B36=0,C35,(E36/2*(B36/3.6+'Dropdown-Daten'!$H$50/3.6)))","v":46.083333333333329},null,3,32.25,{"$f":"IF('Eingabe - Diagramm'!$K$15>=E36,'Dropdown-Daten'!$H$50,(('Dropdown-Daten'!$H$50/3.6)-('Dropdown-Daten'!$O$66*(E36-'Eingabe - Diagramm'!$K$15)))*3.6)","v":38.200000000000003},13.83333333333333,null,null,13.83333333333333,{"$f":"IF('Eingabe - Diagramm'!$K$15>=E36,E36*(G36/3.6)+H$6,(G36/3.6+G35/3.6)/2*(E36-E35)+H35)","v":13.83333333333333},null,36,false,false,"",false,"",null,"",""]
[null,{"$f":"IF(((B$6/3.6)-('Dropdown-Daten'!$O$55*E37))*3.6>0,((B$6/3.6)-('Dropdown-Daten'!$O$55*E37))*3.6,0)","v":23.619999999999997},{"$f":"IF(B37=0,C36,(E37/2*(B37/3.6+'Dropdown-Daten'!$H$50/3.6)))","v":46.766944444444441},null,3.1,{"$f":"C37-H37","v":31.904999999999998},{"$f":"IF('Eingabe - Diagramm'!$K$15>=E37,'Dropdown-Daten'!$H$50,(('Dropdown-Daten'!$H$50/3.6)-('Dropdown-Daten'!$O$66*(E37-'Eingabe - Diagramm'!$K$15)))*3.6)","v":35.86},14.861944444444443,null,null,14.861944444444443,{"$f":"IF('Eingabe - Diagramm'!$K$15>=E37,E37*(G37/3.6)+H$6,(G37/3.6+G36/3.6)/2*(E37-E36)+H36)","v":14.861944444444443},null,37,false,{"$f":"AND(O37=TRUE,O36=FALSE)","v":false},"",false,"",null,"",""]
[null,{"$f":"IF(((B$6/3.6)-('Dropdown-Daten'!$O$55*E38))*3.6>0,((B$6/3.6)-('Dropdown-Daten'!$O$55*E38))*3.6,0)","v":21.639999999999993},{"$f":"IF(B38=0,C37,(E38/2*(B38/3.6+'Dropdown-Daten'!$H$50/3.6)))","v":47.395555555555553},null,3.2,31.57,{"$f":"IF('Eingabe - Diagramm'!$K$15>=E38,'Dropdown-Daten'!$H$50,(('Dropdown-Daten'!$H$50/3.6)-('Dropdown-Daten'!$O$66*(E38-'Eingabe - Diagramm'!$K$15)))*3.6)","v":33.519999999999996},15.825555555555555,null,null,{"$f":"IF(G38>0,H38,K37)","v":15.825555555555555},{"$f":"IF('Eingabe - Diagramm'!$K$15>=E38,E38*(G38/3.6)+H$6,(G38/3.6+G37/3.6)/2*(E38-E37)+H37)","v":15.825555555555555},null,38,false,false,"",false,"",null,"",""]
[null,{"$f":"IF(((B$6/3.6)-('Dropdown-Daten'!$O$55*E39))*3.6>0,((B$6/3.6)-('Dropdown-Daten'!$O$55*E39))*3.6,0)","v":19.660000000000004},{"$f":"IF(B39=0,C38,(E39/2*(B39/3.6+'Dropdown-Daten'!$H$50/3.6)))","v":47.969166666666666},null,3.3,31.245000000000005,{"$f":"IF('Eingabe - Diagramm'!$K$15>=E39,'Dropdown-Daten'!$H$50,(('Dropdown-Daten'!$H$50/3.6)-('Dropdown-Daten'!$O$66*(E39-'Eingabe - Diagramm'!$K$15)))*3.6)","v":31.180000000000003},16.724166666666662,null,null,16.724166666666662,{"$f":"IF('Eingabe - Diagramm'!$K$15>=E39,E39*(G39/3.6)+H$6,(G39/3.6+G38/3.6)/2*(E39-E38)+H38)","v":16.724166666666662},null,39,false,false,"",false,"",null,"",""]
[null,{"$f":"IF(((B$6/3.6)-('Dropdown-Daten'!$O$55*E40))*3.6>0,((B$6/3.6)-('Dropdown-Daten'!$O$55*E40))*3.6,0)","v":17.680000000000003},{"$f":"IF(B40=0,C39,(E40/2*(B40/3.6+'Dropdown-Daten'!$H$50/3.6)))","v":48.487777777777779},null,3.4,30.930000000000007,{"$f":"IF('Eingabe - Diagramm'!$K$15>=E40,'Dropdown-Daten'!$H$50,(('Dropdown-Daten'!$H$50/3.6)-('Dropdown-Daten'!$O$66*(E40-'Eingabe - Diagramm'!$K$15)))*3.6)","v":28.84},17.557777777777773,null,null,17.557777777777773,{"$f":"IF('Eingabe - Diagramm'!$K$15>=E40,E40*(G40/3.6)+H$6,(G40/3.6+G39/3.6)/2*(E40-E39)+H39)","v":17.557777777777773},null,40,false,false,"",false,"",null,"",""]
{"$rows_left_out":135}