{"text_format":"3","workbook":"xlsx","n_sheets":10,"sheets":["Zusammenzug","A","B","C","D","E","Hilfstab AE","Hilfstab Löhne","Hilfstab Auswahl SOPÄ","Hilfstab SSP"],"not_rendered":{"images":2,"defined_names":27,"comments":2},"read":"whole","date_system":"1900"}

{"sheet":"Zusammenzug","index":0,"n_rows":31,"n_cols":7,"rows_kept":31,"merged":[[5,1,5,4],[31,2,31,4]]}
["Pensenplan Schule",{"$nulls":3},"Version 2/2024"]
["Element A. Schulische Förderung"]
[]
["Kalenderjahr",2024,{"$nulls":4},{"$f":"+B4-1","v":2023}]
[]
["Sonderschule"]
[]
["Anzahl Sonderschülerinnen und Sonderschüler:",null,null,{"$f":"+A!F8","v":0}]
[{"$f":"\"Stichtag 1. November \"&$G$4","v":"Stichtag 1. November 2023"}]
["Anzahl Klassen",null,null,{"$f":"+A!F9","v":0}]
[]
["Übersicht Stellen",{"$f":"\"Stichtag 1. November \"&G4","v":"Stichtag 1. November 2023"},null,"Stellenprozente","Lohnsumme"]
["Lehrpersonen",null,null,{"$f":"+B!M15","v":{"v":0,"d":"0.0%"}},{"$f":"+B!R15+'C'!M17","v":0}]
["Weiteres Personal",null,null,{"$f":"+'C'!G17","v":{"v":0,"d":"0.0%"}},{"$f":"+'C'!H17-'C'!M17","v":0}]
["Total Anstellungen im Schulbereich",null,null,{"$f":"SUM(D13:D14)","v":{"v":0,"d":"0.0%"}},{"$f":"SUM(E13:E14)","v":0}]
["Reduktion für weiteres Personal",null,null,{"$f":"-('C'!G17-'C'!I17)","v":{"v":0,"d":"0.0%"}}]
["Zwischentotal",null,null,{"$f":"SUM(D15:D16)","v":{"v":0,"d":"0.0%"}}]
["Reduktion für Altersentlastungen und Berufseinführung",null,null,{"$f":"-B!T15","v":{"v":0,"d":"0.0%"}}]
["Angerechnete Stellen und Löhne",null,null,{"$f":"SUM(D17:D18)","v":{"v":0,"d":"0.0%"}},{"$f":"+E15","v":0}]
[]
["Berechnungsgrundlage für die Pauschale Schulische Förderung"]
[{"$f":"\"Angerechnete Stellenprozente, Basis 1. November \"&G$4","v":"Angerechnete Stellenprozente, Basis 1. November 2023"},null,null,{"$f":"+D19","v":{"v":0,"d":"0.0%"}}]
[{"$f":"\"Lohnsumme, Basis Lohneinstufungen \"&B4","v":"Lohnsumme, Basis Lohneinstufungen 2024"},{"$nulls":3},{"$f":"+E19","v":0}]
["Pensenpool",null,null,{"$f":"+A!F11","v":{"v":0,"d":"0.0%"}}]
["Lohnsumme für die Pauschale Schulische Förderung",{"$nulls":3},{"$f":"IF(D22=0,0,E23/D22*D24)","v":0}]
[]
["Information zur Ausbildungsqualifikation des Personals"]
["Sonderschulspezifisch qualifiziertes Personal",null,null,{"$f":"+B!M16+'C'!G18","v":{"v":0,"d":"0.0%"}}]
["Quote sonderschulspezifisch qualifiziertes Personal",null,null,{"$f":"IF(D17=0,0,D28/D17)","v":{"v":0,"d":"0.0%"}}]
[]
["Datum",null,"Unterschrift Institutionsleitung"]

{"sheet":"A","index":1,"n_rows":186,"n_cols":12,"rows_kept":186,"merged":[[17,3,17,4],[20,3,20,4],[24,3,24,4]]}
[{"$f":"\"Pensenplan \"&Zusammenzug!B4","v":"Pensenplan 2024"}]
["Teil A: Berechnung des zur Verfügung stehenden Pensums (Pensenpool)"]
[]
[]
[]
[{"$f":"+Zusammenzug!B6","v":{"v":0,"d":"0.0"}}]
[]
["Anzahl Sonderschülerinnen und -schüler",{"$nulls":4},{"$f":"SUM(C28:C463)","v":0}]
["Anzahl Klassen",{"$nulls":4},{"$f":"SUM(J28:J486)","v":0}]
[]
["Pensenpool",{"$nulls":4},{"$f":"SUM(G28:G486)+G18+G21","v":{"v":0,"d":"0.0%"}}]
[]
[]
["Eingabefelder sind gelb hinterlegt"]
[]
["Zusatzpensum",null," (3.571% = 1 Lektion Unterricht inkl. alle Arbeitsfelder)"]
[null,null,"Lekt."]
["  Schulische Nachbetreuung \n  (Anzahl Lektionen)",null,null,"für OS-Klasse im letzten Schuljahr",null,{"v":0.03571,"d":"3.571%"},{"$f":"F18*C18","v":{"v":0,"d":"0.000%"}}]
[null,null,"pro Klasse max. 2 Lektionen"]
[null,null,"Klassen"]
["  Anzahl Oberstufen-Klassen (OS)\n  (1 Lekt. Klassenverantwortung)",null,null,"OS-Klasse(n)",null,{"v":0.03571,"d":"3.571%"},{"$f":"C21*F21","v":{"v":0,"d":"0.000%"}}]
[]
["Klassen"]
[]
["Klasse","Lektionen\npro Woche","SuS*\nje BS","Bedarfsstufe (BS)\nin Prozent",null,"Summe\n(SuS x BS)","Pensum\npro Klasse",null,"Anzahl","Anzahl"]
[null,null,"* SuS = Sonderschülerinnen und Sonderschüler"]
[]
[{"$nulls":3},"BS A",{"v":0.207,"d":"20.7%"},{"$f":"C28*E28","v":{"v":0,"d":"0.0%"}},null,null,{"$f":"SUM(C28:C30)","v":0},{"$f":"IF(I28>0,1,0)","v":0},null,1]
[{"$nulls":3},"BS B",{"v":0.253,"d":"25.3%"},{"$f":"C29*E29","v":{"v":0,"d":"0.0%"}}]
[{"$nulls":3},"BS C",{"v":0.386,"d":"38.6%"},{"v":0,"d":"0.0%"},{"$f":"IF(B28<=27,SUM(F28:F30)/27*B28,IF(B28>=27,SUM(F28:F30)/28*B28))","v":{"v":0,"d":"0.0%"}}]
[]
[{"$nulls":3},"BS A",{"v":0.207,"d":"20.7%"},{"$f":"C32*E32","v":{"v":0,"d":"0.0%"}},null,null,{"$f":"SUM(C32:C34)","v":0},{"$f":"IF(I32>0,1,0)","v":0},null,{"$f":"1+L28","v":2}]
[{"$nulls":3},"BS B",{"v":0.253,"d":"25.3%"},{"$f":"C33*E33","v":{"v":0,"d":"0.0%"}}]
[{"$nulls":3},"BS C",{"v":0.386,"d":"38.6%"},{"v":0,"d":"0.0%"},{"$f":"IF(B32<=27,SUM(F32:F34)/27*B32,IF(B32>=27,SUM(F32:F34)/28*B32))","v":{"v":0,"d":"0.0%"}}]
[]
[{"$nulls":3},"BS A",{"v":0.207,"d":"20.7%"},{"$f":"C36*E36","v":{"v":0,"d":"0.0%"}},null,null,{"$f":"SUM(C36:C38)","v":0},{"$f":"IF(I36>0,1,0)","v":0},null,{"$f":"1+L32","v":3}]
[{"$nulls":3},"BS B",{"v":0.253,"d":"25.3%"},{"$f":"C37*E37","v":{"v":0,"d":"0.0%"}}]
[{"$nulls":3},"BS C",{"v":0.386,"d":"38.6%"},{"v":0,"d":"0.0%"},{"$f":"IF(B36<=27,SUM(F36:F38)/27*B36,IF(B36>=27,SUM(F36:F38)/28*B36))","v":{"v":0,"d":"0.0%"}}]
[]
[{"$nulls":3},"BS A",{"v":0.207,"d":"20.7%"},{"$f":"C40*E40","v":{"v":0,"d":"0.0%"}},null,null,{"$f":"SUM(C40:C42)","v":0},{"$f":"IF(I40>0,1,0)","v":0},null,{"$f":"1+L36","v":4}]
[{"$nulls":3},"BS B",{"v":0.253,"d":"25.3%"},{"$f":"C41*E41","v":{"v":0,"d":"0.0%"}}]
[{"$nulls":3},"BS C",{"v":0.386,"d":"38.6%"},{"v":0,"d":"0.0%"},{"$f":"IF(B40<=27,SUM(F40:F42)/27*B40,IF(B40>=27,SUM(F40:F42)/28*B40))","v":{"v":0,"d":"0.0%"}}]
[]
[{"$nulls":3},"BS A",{"v":0.207,"d":"20.7%"},{"$f":"C44*E44","v":{"v":0,"d":"0.0%"}},null,null,{"$f":"SUM(C44:C46)","v":0},{"$f":"IF(I44>0,1,0)","v":0},null,{"$f":"1+L40","v":5}]
[{"$nulls":3},"BS B",{"v":0.253,"d":"25.3%"},{"$f":"C45*E45","v":{"v":0,"d":"0.0%"}}]
[{"$nulls":3},"BS C",{"v":0.386,"d":"38.6%"},{"v":0,"d":"0.0%"},{"$f":"IF(B44<=27,SUM(F44:F46)/27*B44,IF(B44>=27,SUM(F44:F46)/28*B44))","v":{"v":0,"d":"0.0%"}}]
[]
[{"$nulls":3},"BS A",{"v":0.207,"d":"20.7%"},{"$f":"C48*E48","v":{"v":0,"d":"0.0%"}},null,null,{"$f":"SUM(C48:C50)","v":0},{"$f":"IF(I48>0,1,0)","v":0},null,{"$f":"1+L44","v":6}]
[{"$nulls":3},"BS B",{"v":0.253,"d":"25.3%"},{"$f":"C49*E49","v":{"v":0,"d":"0.0%"}}]
[{"$nulls":3},"BS C",{"v":0.386,"d":"38.6%"},{"v":0,"d":"0.0%"},{"$f":"IF(B48<=27,SUM(F48:F50)/27*B48,IF(B48>=27,SUM(F48:F50)/28*B48))","v":{"v":0,"d":"0.0%"}}]
[]
[{"$nulls":3},"BS A",{"v":0.207,"d":"20.7%"},{"$f":"C52*E52","v":{"v":0,"d":"0.0%"}},null,null,{"$f":"SUM(C52:C54)","v":0},{"$f":"IF(I52>0,1,0)","v":0},null,{"$f":"1+L48","v":7}]
[{"$nulls":3},"BS B",{"v":0.253,"d":"25.3%"},{"$f":"C53*E53","v":{"v":0,"d":"0.0%"}}]
[{"$nulls":3},"BS C",{"v":0.386,"d":"38.6%"},{"v":0,"d":"0.0%"},{"$f":"IF(B52<=27,SUM(F52:F54)/27*B52,IF(B52>=27,SUM(F52:F54)/28*B52))","v":{"v":0,"d":"0.0%"}}]
[]
[{"$nulls":3},"BS A",{"v":0.207,"d":"20.7%"},{"$f":"C56*E56","v":{"v":0,"d":"0.0%"}},null,null,{"$f":"SUM(C56:C58)","v":0},{"$f":"IF(I56>0,1,0)","v":0},null,{"$f":"1+L52","v":8}]
[{"$nulls":3},"BS B",{"v":0.253,"d":"25.3%"},{"$f":"C57*E57","v":{"v":0,"d":"0.0%"}}]
[{"$nulls":3},"BS C",{"v":0.386,"d":"38.6%"},{"v":0,"d":"0.0%"},{"$f":"IF(B56<=27,SUM(F56:F58)/27*B56,IF(B56>=27,SUM(F56:F58)/28*B56))","v":{"v":0,"d":"0.0%"}}]
[]
[{"$nulls":3},"BS A",{"v":0.207,"d":"20.7%"},{"$f":"C60*E60","v":{"v":0,"d":"0.0%"}},null,null,{"$f":"SUM(C60:C62)","v":0},{"$f":"IF(I60>0,1,0)","v":0},null,{"$f":"1+L56","v":9}]
[{"$nulls":3},"BS B",{"v":0.253,"d":"25.3%"},{"$f":"C61*E61","v":{"v":0,"d":"0.0%"}}]
[{"$nulls":3},"BS C",{"v":0.386,"d":"38.6%"},{"v":0,"d":"0.0%"},{"$f":"IF(B60<=27,SUM(F60:F62)/27*B60,IF(B60>=27,SUM(F60:F62)/28*B60))","v":{"v":0,"d":"0.0%"}}]
[]
[{"$nulls":3},"BS A",{"v":0.207,"d":"20.7%"},{"$f":"C64*E64","v":{"v":0,"d":"0.0%"}},null,null,{"$f":"SUM(C64:C66)","v":0},{"$f":"IF(I64>0,1,0)","v":0},null,{"$f":"1+L60","v":10}]
[{"$nulls":3},"BS B",{"v":0.253,"d":"25.3%"},{"$f":"C65*E65","v":{"v":0,"d":"0.0%"}}]
[{"$nulls":3},"BS C",{"v":0.386,"d":"38.6%"},{"v":0,"d":"0.0%"},{"$f":"IF(B64<=27,SUM(F64:F66)/27*B64,IF(B64>=27,SUM(F64:F66)/28*B64))","v":{"v":0,"d":"0.0%"}}]
[]
[{"$nulls":3},"BS A",{"v":0.207,"d":"20.7%"},{"$f":"C68*E68","v":{"v":0,"d":"0.0%"}},null,null,{"$f":"SUM(C68:C70)","v":0},{"$f":"IF(I68>0,1,0)","v":0},null,{"$f":"1+L64","v":11}]
[{"$nulls":3},"BS B",{"v":0.253,"d":"25.3%"},{"$f":"C69*E69","v":{"v":0,"d":"0.0%"}}]
[{"$nulls":3},"BS C",{"v":0.386,"d":"38.6%"},{"v":0,"d":"0.0%"},{"$f":"IF(B68<=27,SUM(F68:F70)/27*B68,IF(B68>=27,SUM(F68:F70)/28*B68))","v":{"v":0,"d":"0.0%"}}]
[]
[{"$nulls":3},"BS A",{"v":0.207,"d":"20.7%"},{"$f":"C72*E72","v":{"v":0,"d":"0.0%"}},null,null,{"$f":"SUM(C72:C74)","v":0},{"$f":"IF(I72>0,1,0)","v":0},null,{"$f":"1+L68","v":12}]
[{"$nulls":3},"BS B",{"v":0.253,"d":"25.3%"},{"$f":"C73*E73","v":{"v":0,"d":"0.0%"}}]
[{"$nulls":3},"BS C",{"v":0.386,"d":"38.6%"},{"v":0,"d":"0.0%"},{"$f":"IF(B72<=27,SUM(F72:F74)/27*B72,IF(B72>=27,SUM(F72:F74)/28*B72))","v":{"v":0,"d":"0.0%"}}]
[]
[{"$nulls":3},"BS A",{"v":0.207,"d":"20.7%"},{"$f":"C76*E76","v":{"v":0,"d":"0.0%"}},null,null,{"$f":"SUM(C76:C78)","v":0},{"$f":"IF(I76>0,1,0)","v":0},null,{"$f":"1+L72","v":13}]
[{"$nulls":3},"BS B",{"v":0.253,"d":"25.3%"},{"$f":"C77*E77","v":{"v":0,"d":"0.0%"}}]
[{"$nulls":3},"BS C",{"v":0.386,"d":"38.6%"},{"v":0,"d":"0.0%"},{"$f":"IF(B76<=27,SUM(F76:F78)/27*B76,IF(B76>=27,SUM(F76:F78)/28*B76))","v":{"v":0,"d":"0.0%"}}]
[]
[{"$nulls":3},"BS A",{"v":0.207,"d":"20.7%"},{"$f":"C80*E80","v":{"v":0,"d":"0.0%"}},null,null,{"$f":"SUM(C80:C82)","v":0},{"$f":"IF(I80>0,1,0)","v":0},null,{"$f":"1+L76","v":14}]
[{"$nulls":3},"BS B",{"v":0.253,"d":"25.3%"},{"$f":"C81*E81","v":{"v":0,"d":"0.0%"}}]
[{"$nulls":3},"BS C",{"v":0.386,"d":"38.6%"},{"v":0,"d":"0.0%"},{"$f":"IF(B80<=27,SUM(F80:F82)/27*B80,IF(B80>=27,SUM(F80:F82)/28*B80))","v":{"v":0,"d":"0.0%"}}]
[]
[{"$nulls":3},"BS A",{"v":0.207,"d":"20.7%"},{"$f":"C84*E84","v":{"v":0,"d":"0.0%"}},null,null,{"$f":"SUM(C84:C86)","v":0},{"$f":"IF(I84>0,1,0)","v":0},null,{"$f":"1+L80","v":15}]
[{"$nulls":3},"BS B",{"v":0.253,"d":"25.3%"},{"$f":"C85*E85","v":{"v":0,"d":"0.0%"}}]
[{"$nulls":3},"BS C",{"v":0.386,"d":"38.6%"},{"v":0,"d":"0.0%"},{"$f":"IF(B84<=27,SUM(F84:F86)/27*B84,IF(B84>=27,SUM(F84:F86)/28*B84))","v":{"v":0,"d":"0.0%"}}]
[]
[{"$nulls":3},"BS A",{"v":0.207,"d":"20.7%"},{"$f":"C88*E88","v":{"v":0,"d":"0.0%"}},null,null,{"$f":"SUM(C88:C90)","v":0},{"$f":"IF(I88>0,1,0)","v":0},null,{"$f":"1+L84","v":16}]
[{"$nulls":3},"BS B",{"v":0.253,"d":"25.3%"},{"$f":"C89*E89","v":{"v":0,"d":"0.0%"}}]
[{"$nulls":3},"BS C",{"v":0.386,"d":"38.6%"},{"v":0,"d":"0.0%"},{"$f":"IF(B88<=27,SUM(F88:F90)/27*B88,IF(B88>=27,SUM(F88:F90)/28*B88))","v":{"v":0,"d":"0.0%"}}]
[]
[{"$nulls":3},"BS A",{"v":0.207,"d":"20.7%"},{"$f":"C92*E92","v":{"v":0,"d":"0.0%"}},null,null,{"$f":"SUM(C92:C94)","v":0},{"$f":"IF(I92>0,1,0)","v":0},null,{"$f":"1+L88","v":17}]
[{"$nulls":3},"BS B",{"v":0.253,"d":"25.3%"},{"$f":"C93*E93","v":{"v":0,"d":"0.0%"}}]
[{"$nulls":3},"BS C",{"v":0.386,"d":"38.6%"},{"v":0,"d":"0.0%"},{"$f":"IF(B92<=27,SUM(F92:F94)/27*B92,IF(B92>=27,SUM(F92:F94)/28*B92))","v":{"v":0,"d":"0.0%"}}]
[]
[{"$nulls":3},"BS A",{"v":0.207,"d":"20.7%"},{"$f":"C96*E96","v":{"v":0,"d":"0.0%"}},null,null,{"$f":"SUM(C96:C98)","v":0},{"$f":"IF(I96>0,1,0)","v":0},null,{"$f":"1+L92","v":18}]
[{"$nulls":3},"BS B",{"v":0.253,"d":"25.3%"},{"$f":"C97*E97","v":{"v":0,"d":"0.0%"}}]
[{"$nulls":3},"BS C",{"v":0.386,"d":"38.6%"},{"v":0,"d":"0.0%"},{"$f":"IF(B96<=27,SUM(F96:F98)/27*B96,IF(B96>=27,SUM(F96:F98)/28*B96))","v":{"v":0,"d":"0.0%"}}]
[]
[{"$nulls":3},"BS A",{"v":0.207,"d":"20.7%"},{"$f":"C100*E100","v":{"v":0,"d":"0.0%"}},null,null,{"$f":"SUM(C100:C102)","v":0},{"$f":"IF(I100>0,1,0)","v":0},null,{"$f":"1+L96","v":19}]
[{"$nulls":3},"BS B",{"v":0.253,"d":"25.3%"},{"$f":"C101*E101","v":{"v":0,"d":"0.0%"}}]
[{"$nulls":3},"BS C",{"v":0.386,"d":"38.6%"},{"v":0,"d":"0.0%"},{"$f":"IF(B100<=27,SUM(F100:F102)/27*B100,IF(B100>=27,SUM(F100:F102)/28*B100))","v":{"v":0,"d":"0.0%"}}]
[]
[{"$nulls":3},"BS A",{"v":0.207,"d":"20.7%"},{"$f":"C104*E104","v":{"v":0,"d":"0.0%"}},null,null,{"$f":"SUM(C104:C106)","v":0},{"$f":"IF(I104>0,1,0)","v":0},null,{"$f":"1+L100","v":20}]
[{"$nulls":3},"BS B",{"v":0.253,"d":"25.3%"},{"$f":"C105*E105","v":{"v":0,"d":"0.0%"}}]
[{"$nulls":3},"BS C",{"v":0.386,"d":"38.6%"},{"v":0,"d":"0.0%"},{"$f":"IF(B104<=27,SUM(F104:F106)/27*B104,IF(B104>=27,SUM(F104:F106)/28*B104))","v":{"v":0,"d":"0.0%"}}]
[]
[{"$nulls":3},"BS A",{"v":0.207,"d":"20.7%"},{"$f":"C108*E108","v":{"v":0,"d":"0.0%"}},null,null,{"$f":"SUM(C108:C110)","v":0},{"$f":"IF(I108>0,1,0)","v":0},null,{"$f":"1+L104","v":21}]
[{"$nulls":3},"BS B",{"v":0.253,"d":"25.3%"},{"$f":"C109*E109","v":{"v":0,"d":"0.0%"}}]
[{"$nulls":3},"BS C",{"v":0.386,"d":"38.6%"},{"v":0,"d":"0.0%"},{"$f":"IF(B108<=27,SUM(F108:F110)/27*B108,IF(B108>=27,SUM(F108:F110)/28*B108))","v":{"v":0,"d":"0.0%"}}]
[]
[{"$nulls":3},"BS A",{"v":0.207,"d":"20.7%"},{"$f":"C112*E112","v":{"v":0,"d":"0.0%"}},null,null,{"$f":"SUM(C112:C114)","v":0},{"$f":"IF(I112>0,1,0)","v":0},null,{"$f":"1+L108","v":22}]
[{"$nulls":3},"BS B",{"v":0.253,"d":"25.3%"},{"$f":"C113*E113","v":{"v":0,"d":"0.0%"}}]
[{"$nulls":3},"BS C",{"v":0.386,"d":"38.6%"},{"v":0,"d":"0.0%"},{"$f":"IF(B112<=27,SUM(F112:F114)/27*B112,IF(B112>=27,SUM(F112:F114)/28*B112))","v":{"v":0,"d":"0.0%"}}]
[]
[{"$nulls":3},"BS A",{"v":0.207,"d":"20.7%"},{"$f":"C116*E116","v":{"v":0,"d":"0.0%"}},null,null,{"$f":"SUM(C116:C118)","v":0},{"$f":"IF(I116>0,1,0)","v":0},null,{"$f":"1+L112","v":23}]
[{"$nulls":3},"BS B",{"v":0.253,"d":"25.3%"},{"$f":"C117*E117","v":{"v":0,"d":"0.0%"}}]
[{"$nulls":3},"BS C",{"v":0.386,"d":"38.6%"},{"v":0,"d":"0.0%"},{"$f":"IF(B116<=27,SUM(F116:F118)/27*B116,IF(B116>=27,SUM(F116:F118)/28*B116))","v":{"v":0,"d":"0.0%"}}]
[]
[{"$nulls":3},"BS A",{"v":0.207,"d":"20.7%"},{"$f":"C120*E120","v":{"v":0,"d":"0.0%"}},null,null,{"$f":"SUM(C120:C122)","v":0},{"$f":"IF(I120>0,1,0)","v":0},null,{"$f":"1+L116","v":24}]
[{"$nulls":3},"BS B",{"v":0.253,"d":"25.3%"},{"$f":"C121*E121","v":{"v":0,"d":"0.0%"}}]
[{"$nulls":3},"BS C",{"v":0.386,"d":"38.6%"},{"v":0,"d":"0.0%"},{"$f":"IF(B120<=27,SUM(F120:F122)/27*B120,IF(B120>=27,SUM(F120:F122)/28*B120))","v":{"v":0,"d":"0.0%"}}]
[]
[{"$nulls":3},"BS A",{"v":0.207,"d":"20.7%"},{"$f":"C124*E124","v":{"v":0,"d":"0.0%"}},null,null,{"$f":"SUM(C124:C126)","v":0},{"$f":"IF(I124>0,1,0)","v":0},null,{"$f":"1+L120","v":25}]
[{"$nulls":3},"BS B",{"v":0.253,"d":"25.3%"},{"$f":"C125*E125","v":{"v":0,"d":"0.0%"}}]
[{"$nulls":3},"BS C",{"v":0.386,"d":"38.6%"},{"v":0,"d":"0.0%"},{"$f":"IF(B124<=27,SUM(F124:F126)/27*B124,IF(B124>=27,SUM(F124:F126)/28*B124))","v":{"v":0,"d":"0.0%"}}]
[]
[{"$nulls":3},"BS A",{"v":0.207,"d":"20.7%"},{"$f":"C128*E128","v":{"v":0,"d":"0.0%"}},null,null,{"$f":"SUM(C128:C130)","v":0},{"$f":"IF(I128>0,1,0)","v":0},null,{"$f":"1+L124","v":26}]
[{"$nulls":3},"BS B",{"v":0.253,"d":"25.3%"},{"$f":"C129*E129","v":{"v":0,"d":"0.0%"}}]
[{"$nulls":3},"BS C",{"v":0.386,"d":"38.6%"},{"v":0,"d":"0.0%"},{"$f":"IF(B128<=27,SUM(F128:F130)/27*B128,IF(B128>=27,SUM(F128:F130)/28*B128))","v":{"v":0,"d":"0.0%"}}]
[]
[{"$nulls":3},"BS A",{"v":0.207,"d":"20.7%"},{"$f":"C132*E132","v":{"v":0,"d":"0.0%"}},null,null,{"$f":"SUM(C132:C134)","v":0},{"$f":"IF(I132>0,1,0)","v":0},null,{"$f":"1+L128","v":27}]
[{"$nulls":3},"BS B",{"v":0.253,"d":"25.3%"},{"$f":"C133*E133","v":{"v":0,"d":"0.0%"}}]
[{"$nulls":3},"BS C",{"v":0.386,"d":"38.6%"},{"v":0,"d":"0.0%"},{"$f":"IF(B132<=27,SUM(F132:F134)/27*B132,IF(B132>=27,SUM(F132:F134)/28*B132))","v":{"v":0,"d":"0.0%"}}]
[]
[{"$nulls":3},"BS A",{"v":0.207,"d":"20.7%"},{"$f":"C136*E136","v":{"v":0,"d":"0.0%"}},null,null,{"$f":"SUM(C136:C138)","v":0},{"$f":"IF(I136>0,1,0)","v":0},null,{"$f":"1+L132","v":28}]
[{"$nulls":3},"BS B",{"v":0.253,"d":"25.3%"},{"$f":"C137*E137","v":{"v":0,"d":"0.0%"}}]
[{"$nulls":3},"BS C",{"v":0.386,"d":"38.6%"},{"v":0,"d":"0.0%"},{"$f":"IF(B136<=27,SUM(F136:F138)/27*B136,IF(B136>=27,SUM(F136:F138)/28*B136))","v":{"v":0,"d":"0.0%"}}]
[]
[{"$nulls":3},"BS A",{"v":0.207,"d":"20.7%"},{"$f":"C140*E140","v":{"v":0,"d":"0.0%"}},null,null,{"$f":"SUM(C140:C142)","v":0},{"$f":"IF(I140>0,1,0)","v":0},null,{"$f":"1+L136","v":29}]
[{"$nulls":3},"BS B",{"v":0.253,"d":"25.3%"},{"$f":"C141*E141","v":{"v":0,"d":"0.0%"}}]
[{"$nulls":3},"BS C",{"v":0.386,"d":"38.6%"},{"v":0,"d":"0.0%"},{"$f":"IF(B140<=27,SUM(F140:F142)/27*B140,IF(B140>=27,SUM(F140:F142)/28*B140))","v":{"v":0,"d":"0.0%"}}]
[]
[{"$nulls":3},"BS A",{"v":0.207,"d":"20.7%"},{"$f":"C144*E144","v":{"v":0,"d":"0.0%"}},null,null,{"$f":"SUM(C144:C146)","v":0},{"$f":"IF(I144>0,1,0)","v":0},null,{"$f":"1+L140","v":30}]
[{"$nulls":3},"BS B",{"v":0.253,"d":"25.3%"},{"$f":"C145*E145","v":{"v":0,"d":"0.0%"}}]
[{"$nulls":3},"BS C",{"v":0.386,"d":"38.6%"},{"v":0,"d":"0.0%"},{"$f":"IF(B144<=27,SUM(F144:F146)/27*B144,IF(B144>=27,SUM(F144:F146)/28*B144))","v":{"v":0,"d":"0.0%"}}]
[]
[{"$nulls":3},"BS A",{"v":0.207,"d":"20.7%"},{"$f":"C148*E148","v":{"v":0,"d":"0.0%"}},null,null,{"$f":"SUM(C148:C150)","v":0},{"$f":"IF(I148>0,1,0)","v":0},null,{"$f":"1+L144","v":31}]
[{"$nulls":3},"BS B",{"v":0.253,"d":"25.3%"},{"$f":"C149*E149","v":{"v":0,"d":"0.0%"}}]
[{"$nulls":3},"BS C",{"v":0.386,"d":"38.6%"},{"v":0,"d":"0.0%"},{"$f":"IF(B148<=27,SUM(F148:F150)/27*B148,IF(B148>=27,SUM(F148:F150)/28*B148))","v":{"v":0,"d":"0.0%"}}]
[]
[{"$nulls":3},"BS A",{"v":0.207,"d":"20.7%"},{"$f":"C152*E152","v":{"v":0,"d":"0.0%"}},null,null,{"$f":"SUM(C152:C154)","v":0},{"$f":"IF(I152>0,1,0)","v":0},null,{"$f":"1+L148","v":32}]
[{"$nulls":3},"BS B",{"v":0.253,"d":"25.3%"},{"$f":"C153*E153","v":{"v":0,"d":"0.0%"}}]
[{"$nulls":3},"BS C",{"v":0.386,"d":"38.6%"},{"v":0,"d":"0.0%"},{"$f":"IF(B152<=27,SUM(F152:F154)/27*B152,IF(B152>=27,SUM(F152:F154)/28*B152))","v":{"v":0,"d":"0.0%"}}]
[]
[{"$nulls":3},"BS A",{"v":0.207,"d":"20.7%"},{"$f":"C156*E156","v":{"v":0,"d":"0.0%"}},null,null,{"$f":"SUM(C156:C158)","v":0},{"$f":"IF(I156>0,1,0)","v":0},null,{"$f":"1+L152","v":33}]
[{"$nulls":3},"BS B",{"v":0.253,"d":"25.3%"},{"$f":"C157*E157","v":{"v":0,"d":"0.0%"}}]
[{"$nulls":3},"BS C",{"v":0.386,"d":"38.6%"},{"v":0,"d":"0.0%"},{"$f":"IF(B156<=27,SUM(F156:F158)/27*B156,IF(B156>=27,SUM(F156:F158)/28*B156))","v":{"v":0,"d":"0.0%"}}]
[]
[{"$nulls":3},"BS A",{"v":0.207,"d":"20.7%"},{"$f":"C160*E160","v":{"v":0,"d":"0.0%"}},null,null,{"$f":"SUM(C160:C162)","v":0},{"$f":"IF(I160>0,1,0)","v":0},null,{"$f":"1+L156","v":34}]
[{"$nulls":3},"BS B",{"v":0.253,"d":"25.3%"},{"$f":"C161*E161","v":{"v":0,"d":"0.0%"}}]
[{"$nulls":3},"BS C",{"v":0.386,"d":"38.6%"},{"v":0,"d":"0.0%"},{"$f":"IF(B160<=27,SUM(F160:F162)/27*B160,IF(B160>=27,SUM(F160:F162)/28*B160))","v":{"v":0,"d":"0.0%"}}]
[]
[{"$nulls":3},"BS A",{"v":0.207,"d":"20.7%"},{"$f":"C164*E164","v":{"v":0,"d":"0.0%"}},null,null,{"$f":"SUM(C164:C166)","v":0},{"$f":"IF(I164>0,1,0)","v":0},null,{"$f":"1+L160","v":35}]
[{"$nulls":3},"BS B",{"v":0.253,"d":"25.3%"},{"$f":"C165*E165","v":{"v":0,"d":"0.0%"}}]
[{"$nulls":3},"BS C",{"v":0.386,"d":"38.6%"},{"v":0,"d":"0.0%"},{"$f":"IF(B164<=27,SUM(F164:F166)/27*B164,IF(B164>=27,SUM(F164:F166)/28*B164))","v":{"v":0,"d":"0.0%"}}]
[]
[{"$nulls":3},"BS A",{"v":0.207,"d":"20.7%"},{"$f":"C168*E168","v":{"v":0,"d":"0.0%"}},null,null,{"$f":"SUM(C168:C170)","v":0},{"$f":"IF(I168>0,1,0)","v":0},null,{"$f":"1+L164","v":36}]
[{"$nulls":3},"BS B",{"v":0.253,"d":"25.3%"},{"$f":"C169*E169","v":{"v":0,"d":"0.0%"}}]
[{"$nulls":3},"BS C",{"v":0.386,"d":"38.6%"},{"v":0,"d":"0.0%"},{"$f":"IF(B168<=27,SUM(F168:F170)/27*B168,IF(B168>=27,SUM(F168:F170)/28*B168))","v":{"v":0,"d":"0.0%"}}]
[]
[{"$nulls":3},"BS A",{"v":0.207,"d":"20.7%"},{"$f":"C172*E172","v":{"v":0,"d":"0.0%"}},null,null,{"$f":"SUM(C172:C174)","v":0},{"$f":"IF(I172>0,1,0)","v":0},null,{"$f":"1+L168","v":37}]
[{"$nulls":3},"BS B",{"v":0.253,"d":"25.3%"},{"$f":"C173*E173","v":{"v":0,"d":"0.0%"}}]
[{"$nulls":3},"BS C",{"v":0.386,"d":"38.6%"},{"v":0,"d":"0.0%"},{"$f":"IF(B172<=27,SUM(F172:F174)/27*B172,IF(B172>=27,SUM(F172:F174)/28*B172))","v":{"v":0,"d":"0.0%"}}]
[]
[{"$nulls":3},"BS A",{"v":0.207,"d":"20.7%"},{"$f":"C176*E176","v":{"v":0,"d":"0.0%"}},null,null,{"$f":"SUM(C176:C178)","v":0},{"$f":"IF(I176>0,1,0)","v":0},null,{"$f":"1+L172","v":38}]
[{"$nulls":3},"BS B",{"v":0.253,"d":"25.3%"},{"$f":"C177*E177","v":{"v":0,"d":"0.0%"}}]
[{"$nulls":3},"BS C",{"v":0.386,"d":"38.6%"},{"v":0,"d":"0.0%"},{"$f":"IF(B176<=27,SUM(F176:F178)/27*B176,IF(B176>=27,SUM(F176:F178)/28*B176))","v":{"v":0,"d":"0.0%"}}]
[]
[{"$nulls":3},"BS A",{"v":0.207,"d":"20.7%"},{"$f":"C180*E180","v":{"v":0,"d":"0.0%"}},null,null,{"$f":"SUM(C180:C182)","v":0},{"$f":"IF(I180>0,1,0)","v":0},null,{"$f":"1+L176","v":39}]
[{"$nulls":3},"BS B",{"v":0.253,"d":"25.3%"},{"$f":"C181*E181","v":{"v":0,"d":"0.0%"}}]
[{"$nulls":3},"BS C",{"v":0.386,"d":"38.6%"},{"v":0,"d":"0.0%"},{"$f":"IF(B180<=27,SUM(F180:F182)/27*B180,IF(B180>=27,SUM(F180:F182)/28*B180))","v":{"v":0,"d":"0.0%"}}]
[]
[{"$nulls":3},"BS A",{"v":0.207,"d":"20.7%"},{"$f":"C184*E184","v":{"v":0,"d":"0.0%"}},null,null,{"$f":"SUM(C184:C186)","v":0},{"$f":"IF(I184>0,1,0)","v":0},null,{"$f":"1+L180","v":40}]
[{"$nulls":3},"BS B",{"v":0.253,"d":"25.3%"},{"$f":"C185*E185","v":{"v":0,"d":"0.0%"}}]
[{"$nulls":3},"BS C",{"v":0.386,"d":"38.6%"},{"v":0,"d":"0.0%"},{"$f":"IF(B184<=27,SUM(F184:F186)/27*B184,IF(B184>=27,SUM(F184:F186)/28*B184))","v":{"v":0,"d":"0.0%"}}]

{"sheet":"B","index":2,"n_rows":166,"n_cols":31,"rows_kept":166,"merged":[[11,0,13,0],[11,1,13,1],[11,2,13,2],[11,3,13,3],[11,4,13,4],[11,5,13,5],[11,6,13,6],[11,7,13,7],[11,8,13,8],[11,9,13,9],[11,10,13,10],[11,11,13,11],[11,12,13,12],[11,13,13,13],[11,14,12,15],[11,16,13,16],[11,17,13,17],[11,18,13,18],[11,19,13,19],[11,20,13,20],[11,22,13,22],[11,23,13,23],[13,25,13,29],[14,25,14,26]]}
["Kalenderjahr",{"$f":"Zusammenzug!B4","v":2024},{"$f":"+Zusammenzug!B6","v":0},{"$nulls":22},"Berechnungsspalten (ausgeblendet)"]
["Teil B: Pensum des angestellten Personals (Grundlage für die Berechnung des Elements A. Schulische Förderung)"]
["Lehrpersonen"]
[{"$nulls":14},"Abkürzungen, Auswahltexte",{"$nulls":4},"SHP mit Kl. 1","Primarlehrperson (auch Kindergarten): bis Ende 7. Berufsjahr"]
["Hinweise zum Ausfüllen",{"$nulls":13},"SHP mit","Heilpädagogin und Heilpädagoge mit Lehrdiplom, Oberstufe",{"$nulls":3},"SHP mit 85%","Ohne SHP und ohne Lehrdiplom im Schulunterricht"]
["Eingabefelder für freien Text sind gelb hinterlegt",{"$nulls":13},"SHP ohne","Heilpädagogin und Heilpädagoge ohne Lehrdiplom, Logopädinnen",{"$nulls":3},"SH Kiga","Sprachheilschul-Kindergarten-Lehrperson"]
["Auswahlfelder sind dunkelgelb hinterlegt. Auswahlfelder, die zwingend ausgefüllt werden müssen, sind mit dem Standardwert \"Auswählen\" gekennzeichnet. Sie werden hellgelb, wenn ein Wert erfasst wurde.",{"$nulls":13},"OS","Oberstufenlehrperson (ohne Heilpädagogik)",{"$nulls":3},"AE61+","Altersentlastung ab 61 Jahren"]
["Grüne Felder erfassen Informationen für die Statistik des Schulpersonal des Bundes.",{"$nulls":13},"Primar/Kiga","Primarlehrperson (auch Kindergarten): Ab 8. Berufsjahr",{"$nulls":3},"AE56-60","Altersentlastung 56-60 Jahre"]
["Bitte beachten Sie die Hinweise in den Kommentaren der Spaltentitel",{"$nulls":18},"SHP ohne 85%","Ohne SHP und ohne Lehrdiplom im Schulunterricht"]
[]
[]
["Funktion gemäss Anstellung","Art des Arbeits-\nvertrags","Eintritt\nJahr","Jahre im Schul- dienst","Nachname","Vorname","AHV-Nummer","Geschlecht F/M","Geburts- datum","Nationalität","Qualifikation (für BFS)","Diplome","Pensum","LP im\n1. Arbeits-jahr","Einstufung",null,"Bruttolohn 100%","Jahres-\nBruttolohn","Altersentlastung","Entlastung Alter / Berufs-einführung","SHP-Qualifi-kation","SHP","Bemerkungen","Kontrolle"]
[{"$nulls":21},"in Aus-"]
[{"$nulls":14},"Lohntabelle","Lohnklasse",{"$nulls":5},"bildung",{"$nulls":3},"Hilfsspalten Alterentlastung"]
[{"$nulls":4},"Total Stellen  Lehrpersonen",{"$nulls":7},{"$f":"SUM(M17:M166)","v":{"v":0,"d":"0.0%"}},null,null,"Total Lohnsumme",null,{"$f":"SUM(R17:R166)","v":0},null,{"$f":"SUM(T17:T166)","v":{"v":0,"d":"0.000%"}},{"$nulls":5},"Berechnung Pensum bei mehreren Verträgen"]
[{"$nulls":4},"Davon sonderschulspezifisch qualifiziertes Personal",{"$nulls":7},{"$f":"SUMIF(U17:U166,\"ja\",M17:M166)","v":{"v":0,"d":"0.0%"}},{"$nulls":12},"Eindeutigkeit","Summe","Zuordnung Kürzel","Berechnung Altersentlastung","Verknüpfung","Berufseinführung Gutschrift:"]
["Auswählen","Auswählen",{"$nulls":5},"Auswählen",null,"Auswählen","Auswählen",{"$nulls":3},"Auswählen","Auswählen",{"$f":"VLOOKUP(O17&P17,CHOOSE({1,2},'Hilfstab Löhne'!$A$3:$A$187&'Hilfstab Löhne'!$B$3:$B$187,'Hilfstab Löhne'!$D$3:$D$187),2,0)","v":0},{"$f":"IF(Q17=\"ungültige Lohnklasse\",0,M17*Q17)","v":0},{"$f":"IF(AA17<30%,0,IF(AC17=0,0,IF(AB17<>\"leer\",AD17,0)))","v":{"v":0,"d":"0.000%"}},{"$f":"ROUND(IF(S17=0,0,VLOOKUP(S17,'Hilfstab Auswahl SOPÄ'!$L$6:$M$11,2,FALSE)*MIN(1,M17)),5)+AE17","v":{"v":0,"d":"0.000%"}},{"$f":"IF(V17=\"ja\",\"ja\",IF(O17=0,0,IF(OR(O17='Hilfstab Auswahl SOPÄ'!$C$7,O17='Hilfstab Auswahl SOPÄ'!$C$6,O17='Hilfstab Auswahl SOPÄ'!$C$13),\"ja\",\"nein\")))","v":"nein"},null,null,{"$f":"IF(OR(O17='Hilfstab Auswahl SOPÄ'!$C$11,O17='Hilfstab Auswahl SOPÄ'!$C$12)*AND(P17>1),\"* genehmigungspflichtige LK\",0)","v":0},null,{"$f":"IF(E17=\"\",\"\",CONCATENATE(E17,F17,I17))","v":""},{"$f":"SUMIF(Z$17:Z$166,Z17,M$17:M$166)","v":0},{"$f":"VLOOKUP($A17,'Hilfstab Auswahl SOPÄ'!$G$6:$H$9,2,FALSE)","v":"leer"},{"$f":"IF(E17=0,\"\",IF(I17=0,\"Jahrgang fehlt\",IF(YEAR(I17)>'Hilfstab AE'!$B$16,0,IF(AND(YEAR(I17)<('Hilfstab AE'!$B$16+1),YEAR(I17)>('Hilfstab AE'!$D$16-1)),\"AE56-60\",\"AE61+\"))))","v":""},{"$f":"AB17&\" \"&AC17","v":"leer "},{"$f":"IF(N17=\"ja\",IF(AND(M17>24.999%,M17<50.001%),'Hilfstab Auswahl SOPÄ'!$J$5/2,IF(M17>50%,'Hilfstab Auswahl SOPÄ'!$J$5,0)),0)","v":{"v":0,"d":"0.000%"}}]
["Auswählen","Auswählen",{"$nulls":5},"Auswählen",null,"Auswählen","Auswählen",{"$nulls":3},"Auswählen","Auswählen",{"$f":"VLOOKUP(O18&P18,CHOOSE({1,2},'Hilfstab Löhne'!$A$3:$A$187&'Hilfstab Löhne'!$B$3:$B$187,'Hilfstab Löhne'!$D$3:$D$187),2,0)","v":0},0,{"$f":"IF(AA18<30%,0,IF(AC18=0,0,IF(AB18<>\"leer\",AD18,0)))","v":{"v":0,"d":"0.000%"}},{"$f":"ROUND(IF(S18=0,0,IF(OR(S18='Hilfstab Auswahl SOPÄ'!$L$6,S18='Hilfstab Auswahl SOPÄ'!$L$8),IF(M18>1,'Hilfstab Auswahl SOPÄ'!$M$6,'Hilfstab Auswahl SOPÄ'!$M$6*M18),IF(OR(S18='Hilfstab Auswahl SOPÄ'!$L$7,S18='Hilfstab Auswahl SOPÄ'!$L$9),IF(M18>1,'Hilfstab Auswahl SOPÄ'!$M$7,'Hilfstab Auswahl SOPÄ'!$M$7*M18),IF(S18='Hilfstab Auswahl SOPÄ'!$L$10,IF(M18>1,'Hilfstab Auswahl SOPÄ'!$M$10,'Hilfstab Auswahl SOPÄ'!$M$10*M18),IF(M18>1,'Hilfstab Auswahl SOPÄ'!$M$11,'Hilfstab Auswahl SOPÄ'!$M$11*M18))))),5)+AE18","v":{"v":0,"d":"0.000%"}},{"$f":"IF(V18=\"ja\",\"ja\",IF(O18=0,0,IF(OR(O18='Hilfstab Auswahl SOPÄ'!$C$7,O18='Hilfstab Auswahl SOPÄ'!$C$6,O18='Hilfstab Auswahl SOPÄ'!$C$13),\"ja\",\"nein\")))","v":"nein"},null,null,{"$f":"IF(OR(O18='Hilfstab Auswahl SOPÄ'!$C$11,O18='Hilfstab Auswahl SOPÄ'!$C$12)*AND(P18>1),\"* genehmigungspflichtige LK\",0)","v":0},null,{"$f":"IF(E18=\"\",\"\",CONCATENATE(E18,F18,I18))","v":""},{"$f":"SUMIF(Z$17:Z$166,Z18,M$17:M$166)","v":0},{"$f":"VLOOKUP($A18,'Hilfstab Auswahl SOPÄ'!$G$6:$H$9,2,FALSE)","v":"leer"},{"$f":"IF(E18=0,\"\",IF(I18=0,\"Jahrgang fehlt\",IF(YEAR(I18)>'Hilfstab AE'!$B$16,0,IF(AND(YEAR(I18)<('Hilfstab AE'!$B$16+1),YEAR(I18)>('Hilfstab AE'!$D$16-1)),\"AE56-60\",\"AE61+\"))))","v":""},"leer ",{"$f":"IF(N18=\"ja\",IF(AND(M18>24.999%,M18<50.001%),'Hilfstab Auswahl SOPÄ'!$J$5/2,IF(M18>50%,'Hilfstab Auswahl SOPÄ'!$J$5,0)),0)","v":{"v":0,"d":"0.000%"}}]
["Auswählen","Auswählen",{"$nulls":5},"Auswählen",null,"Auswählen","Auswählen",{"$nulls":3},"Auswählen","Auswählen",{"$f":"VLOOKUP(O19&P19,CHOOSE({1,2},'Hilfstab Löhne'!$A$3:$A$187&'Hilfstab Löhne'!$B$3:$B$187,'Hilfstab Löhne'!$D$3:$D$187),2,0)","v":0},0,{"v":0,"d":"0.000%"},{"$f":"ROUND(IF(S19=0,0,IF(OR(S19='Hilfstab Auswahl SOPÄ'!$L$6,S19='Hilfstab Auswahl SOPÄ'!$L$8),IF(M19>1,'Hilfstab Auswahl SOPÄ'!$M$6,'Hilfstab Auswahl SOPÄ'!$M$6*M19),IF(OR(S19='Hilfstab Auswahl SOPÄ'!$L$7,S19='Hilfstab Auswahl SOPÄ'!$L$9),IF(M19>1,'Hilfstab Auswahl SOPÄ'!$M$7,'Hilfstab Auswahl SOPÄ'!$M$7*M19),IF(S19='Hilfstab Auswahl SOPÄ'!$L$10,IF(M19>1,'Hilfstab Auswahl SOPÄ'!$M$10,'Hilfstab Auswahl SOPÄ'!$M$10*M19),IF(M19>1,'Hilfstab Auswahl SOPÄ'!$M$11,'Hilfstab Auswahl SOPÄ'!$M$11*M19))))),5)+AE19","v":{"v":0,"d":"0.000%"}},{"$f":"IF(V19=\"ja\",\"ja\",IF(O19=0,0,IF(OR(O19='Hilfstab Auswahl SOPÄ'!$C$7,O19='Hilfstab Auswahl SOPÄ'!$C$6,O19='Hilfstab Auswahl SOPÄ'!$C$13),\"ja\",\"nein\")))","v":"nein"},null,null,{"$f":"IF(OR(O19='Hilfstab Auswahl SOPÄ'!$C$11,O19='Hilfstab Auswahl SOPÄ'!$C$12)*AND(P19>1),\"* genehmigungspflichtige LK\",0)","v":0},null,"",0,{"$f":"VLOOKUP($A19,'Hilfstab Auswahl SOPÄ'!$G$6:$H$9,2,FALSE)","v":"leer"},{"$f":"IF(E19=0,\"\",IF(I19=0,\"Jahrgang fehlt\",IF(YEAR(I19)>'Hilfstab AE'!$B$16,0,IF(AND(YEAR(I19)<('Hilfstab AE'!$B$16+1),YEAR(I19)>('Hilfstab AE'!$D$16-1)),\"AE56-60\",\"AE61+\"))))","v":""},"leer ",{"$f":"IF(N19=\"ja\",IF(AND(M19>24.999%,M19<50.001%),'Hilfstab Auswahl SOPÄ'!$J$5/2,IF(M19>50%,'Hilfstab Auswahl SOPÄ'!$J$5,0)),0)","v":{"v":0,"d":"0.000%"}}]
["Auswählen","Auswählen",{"$nulls":5},"Auswählen",null,"Auswählen","Auswählen",{"$nulls":3},"Auswählen","Auswählen",{"$f":"VLOOKUP(O20&P20,CHOOSE({1,2},'Hilfstab Löhne'!$A$3:$A$187&'Hilfstab Löhne'!$B$3:$B$187,'Hilfstab Löhne'!$D$3:$D$187),2,0)","v":0},{"$f":"IF(Q20=\"ungültige Lohnklasse\",0,M20*Q20)","v":0},{"v":0,"d":"0.000%"},{"$f":"ROUND(IF(S20=0,0,IF(OR(S20='Hilfstab Auswahl SOPÄ'!$L$6,S20='Hilfstab Auswahl SOPÄ'!$L$8),IF(M20>1,'Hilfstab Auswahl SOPÄ'!$M$6,'Hilfstab Auswahl SOPÄ'!$M$6*M20),IF(OR(S20='Hilfstab Auswahl SOPÄ'!$L$7,S20='Hilfstab Auswahl SOPÄ'!$L$9),IF(M20>1,'Hilfstab Auswahl SOPÄ'!$M$7,'Hilfstab Auswahl SOPÄ'!$M$7*M20),IF(S20='Hilfstab Auswahl SOPÄ'!$L$10,IF(M20>1,'Hilfstab Auswahl SOPÄ'!$M$10,'Hilfstab Auswahl SOPÄ'!$M$10*M20),IF(M20>1,'Hilfstab Auswahl SOPÄ'!$M$11,'Hilfstab Auswahl SOPÄ'!$M$11*M20))))),5)+AE20","v":{"v":0,"d":"0.000%"}},{"$f":"IF(V20=\"ja\",\"ja\",IF(O20=0,0,IF(OR(O20='Hilfstab Auswahl SOPÄ'!$C$7,O20='Hilfstab Auswahl SOPÄ'!$C$6,O20='Hilfstab Auswahl SOPÄ'!$C$13),\"ja\",\"nein\")))","v":"nein"},null,null,{"$f":"IF(OR(O20='Hilfstab Auswahl SOPÄ'!$C$11,O20='Hilfstab Auswahl SOPÄ'!$C$12)*AND(P20>1),\"* genehmigungspflichtige LK\",0)","v":0},null,"",{"$f":"SUMIF(Z$17:Z$166,Z20,M$17:M$166)","v":0},{"$f":"VLOOKUP($A20,'Hilfstab Auswahl SOPÄ'!$G$6:$H$9,2,FALSE)","v":"leer"},{"$f":"IF(E20=0,\"\",IF(I20=0,\"Jahrgang fehlt\",IF(YEAR(I20)>'Hilfstab AE'!$B$16,0,IF(AND(YEAR(I20)<('Hilfstab AE'!$B$16+1),YEAR(I20)>('Hilfstab AE'!$D$16-1)),\"AE56-60\",\"AE61+\"))))","v":""},{"$f":"AB20&\" \"&AC20","v":"leer "},{"$f":"IF(N20=\"ja\",IF(AND(M20>24.999%,M20<50.001%),'Hilfstab Auswahl SOPÄ'!$J$5/2,IF(M20>50%,'Hilfstab Auswahl SOPÄ'!$J$5,0)),0)","v":{"v":0,"d":"0.000%"}}]
["Auswählen","Auswählen",{"$nulls":5},"Auswählen",null,"Auswählen","Auswählen",{"$nulls":3},"Auswählen","Auswählen",{"$f":"VLOOKUP(O21&P21,CHOOSE({1,2},'Hilfstab Löhne'!$A$3:$A$187&'Hilfstab Löhne'!$B$3:$B$187,'Hilfstab Löhne'!$D$3:$D$187),2,0)","v":0},{"$f":"IF(Q21=\"ungültige Lohnklasse\",0,M21*Q21)","v":0},{"v":0,"d":"0.000%"},{"$f":"ROUND(IF(S21=0,0,IF(OR(S21='Hilfstab Auswahl SOPÄ'!$L$6,S21='Hilfstab Auswahl SOPÄ'!$L$8),IF(M21>1,'Hilfstab Auswahl SOPÄ'!$M$6,'Hilfstab Auswahl SOPÄ'!$M$6*M21),IF(OR(S21='Hilfstab Auswahl SOPÄ'!$L$7,S21='Hilfstab Auswahl SOPÄ'!$L$9),IF(M21>1,'Hilfstab Auswahl SOPÄ'!$M$7,'Hilfstab Auswahl SOPÄ'!$M$7*M21),IF(S21='Hilfstab Auswahl SOPÄ'!$L$10,IF(M21>1,'Hilfstab Auswahl SOPÄ'!$M$10,'Hilfstab Auswahl SOPÄ'!$M$10*M21),IF(M21>1,'Hilfstab Auswahl SOPÄ'!$M$11,'Hilfstab Auswahl SOPÄ'!$M$11*M21))))),5)+AE21","v":{"v":0,"d":"0.000%"}},{"$f":"IF(V21=\"ja\",\"ja\",IF(O21=0,0,IF(OR(O21='Hilfstab Auswahl SOPÄ'!$C$7,O21='Hilfstab Auswahl SOPÄ'!$C$6,O21='Hilfstab Auswahl SOPÄ'!$C$13),\"ja\",\"nein\")))","v":"nein"},null,null,{"$f":"IF(OR(O21='Hilfstab Auswahl SOPÄ'!$C$11,O21='Hilfstab Auswahl SOPÄ'!$C$12)*AND(P21>1),\"* genehmigungspflichtige LK\",0)","v":0},null,"",{"$f":"SUMIF(Z$17:Z$166,Z21,M$17:M$166)","v":0},{"$f":"VLOOKUP($A21,'Hilfstab Auswahl SOPÄ'!$G$6:$H$9,2,FALSE)","v":"leer"},{"$f":"IF(E21=0,\"\",IF(I21=0,\"Jahrgang fehlt\",IF(YEAR(I21)>'Hilfstab AE'!$B$16,0,IF(AND(YEAR(I21)<('Hilfstab AE'!$B$16+1),YEAR(I21)>('Hilfstab AE'!$D$16-1)),\"AE56-60\",\"AE61+\"))))","v":""},{"$f":"AB21&\" \"&AC21","v":"leer "},{"$f":"IF(N21=\"ja\",IF(AND(M21>24.999%,M21<50.001%),'Hilfstab Auswahl SOPÄ'!$J$5/2,IF(M21>50%,'Hilfstab Auswahl SOPÄ'!$J$5,0)),0)","v":{"v":0,"d":"0.000%"}}]
["Auswählen","Auswählen",{"$nulls":5},"Auswählen",null,"Auswählen","Auswählen",{"$nulls":3},"Auswählen","Auswählen",{"$f":"VLOOKUP(O22&P22,CHOOSE({1,2},'Hilfstab Löhne'!$A$3:$A$187&'Hilfstab Löhne'!$B$3:$B$187,'Hilfstab Löhne'!$D$3:$D$187),2,0)","v":0},0,{"v":0,"d":"0.000%"},{"$f":"ROUND(IF(S22=0,0,IF(OR(S22='Hilfstab Auswahl SOPÄ'!$L$6,S22='Hilfstab Auswahl SOPÄ'!$L$8),IF(M22>1,'Hilfstab Auswahl SOPÄ'!$M$6,'Hilfstab Auswahl SOPÄ'!$M$6*M22),IF(OR(S22='Hilfstab Auswahl SOPÄ'!$L$7,S22='Hilfstab Auswahl SOPÄ'!$L$9),IF(M22>1,'Hilfstab Auswahl SOPÄ'!$M$7,'Hilfstab Auswahl SOPÄ'!$M$7*M22),IF(S22='Hilfstab Auswahl SOPÄ'!$L$10,IF(M22>1,'Hilfstab Auswahl SOPÄ'!$M$10,'Hilfstab Auswahl SOPÄ'!$M$10*M22),IF(M22>1,'Hilfstab Auswahl SOPÄ'!$M$11,'Hilfstab Auswahl SOPÄ'!$M$11*M22))))),5)+AE22","v":{"v":0,"d":"0.000%"}},{"$f":"IF(V22=\"ja\",\"ja\",IF(O22=0,0,IF(OR(O22='Hilfstab Auswahl SOPÄ'!$C$7,O22='Hilfstab Auswahl SOPÄ'!$C$6,O22='Hilfstab Auswahl SOPÄ'!$C$13),\"ja\",\"nein\")))","v":"nein"},null,null,{"$f":"IF(OR(O22='Hilfstab Auswahl SOPÄ'!$C$11,O22='Hilfstab Auswahl SOPÄ'!$C$12)*AND(P22>1),\"* genehmigungspflichtige LK\",0)","v":0},null,"",0,{"$f":"VLOOKUP($A22,'Hilfstab Auswahl SOPÄ'!$G$6:$H$9,2,FALSE)","v":"leer"},{"$f":"IF(E22=0,\"\",IF(I22=0,\"Jahrgang fehlt\",IF(YEAR(I22)>'Hilfstab AE'!$B$16,0,IF(AND(YEAR(I22)<('Hilfstab AE'!$B$16+1),YEAR(I22)>('Hilfstab AE'!$D$16-1)),\"AE56-60\",\"AE61+\"))))","v":""},"leer ",{"$f":"IF(N22=\"ja\",IF(AND(M22>24.999%,M22<50.001%),'Hilfstab Auswahl SOPÄ'!$J$5/2,IF(M22>50%,'Hilfstab Auswahl SOPÄ'!$J$5,0)),0)","v":{"v":0,"d":"0.000%"}}]
["Auswählen","Auswählen",{"$nulls":5},"Auswählen",null,"Auswählen","Auswählen",{"$nulls":3},"Auswählen","Auswählen",{"$f":"VLOOKUP(O23&P23,CHOOSE({1,2},'Hilfstab Löhne'!$A$3:$A$187&'Hilfstab Löhne'!$B$3:$B$187,'Hilfstab Löhne'!$D$3:$D$187),2,0)","v":0},0,{"v":0,"d":"0.000%"},{"$f":"ROUND(IF(S23=0,0,IF(OR(S23='Hilfstab Auswahl SOPÄ'!$L$6,S23='Hilfstab Auswahl SOPÄ'!$L$8),IF(M23>1,'Hilfstab Auswahl SOPÄ'!$M$6,'Hilfstab Auswahl SOPÄ'!$M$6*M23),IF(OR(S23='Hilfstab Auswahl SOPÄ'!$L$7,S23='Hilfstab Auswahl SOPÄ'!$L$9),IF(M23>1,'Hilfstab Auswahl SOPÄ'!$M$7,'Hilfstab Auswahl SOPÄ'!$M$7*M23),IF(S23='Hilfstab Auswahl SOPÄ'!$L$10,IF(M23>1,'Hilfstab Auswahl SOPÄ'!$M$10,'Hilfstab Auswahl SOPÄ'!$M$10*M23),IF(M23>1,'Hilfstab Auswahl SOPÄ'!$M$11,'Hilfstab Auswahl SOPÄ'!$M$11*M23))))),5)+AE23","v":{"v":0,"d":"0.000%"}},{"$f":"IF(V23=\"ja\",\"ja\",IF(O23=0,0,IF(OR(O23='Hilfstab Auswahl SOPÄ'!$C$7,O23='Hilfstab Auswahl SOPÄ'!$C$6,O23='Hilfstab Auswahl SOPÄ'!$C$13),\"ja\",\"nein\")))","v":"nein"},null,null,{"$f":"IF(OR(O23='Hilfstab Auswahl SOPÄ'!$C$11,O23='Hilfstab Auswahl SOPÄ'!$C$12)*AND(P23>1),\"* genehmigungspflichtige LK\",0)","v":0},null,"",0,{"$f":"VLOOKUP($A23,'Hilfstab Auswahl SOPÄ'!$G$6:$H$9,2,FALSE)","v":"leer"},{"$f":"IF(E23=0,\"\",IF(I23=0,\"Jahrgang fehlt\",IF(YEAR(I23)>'Hilfstab AE'!$B$16,0,IF(AND(YEAR(I23)<('Hilfstab AE'!$B$16+1),YEAR(I23)>('Hilfstab AE'!$D$16-1)),\"AE56-60\",\"AE61+\"))))","v":""},"leer ",{"$f":"IF(N23=\"ja\",IF(AND(M23>24.999%,M23<50.001%),'Hilfstab Auswahl SOPÄ'!$J$5/2,IF(M23>50%,'Hilfstab Auswahl SOPÄ'!$J$5,0)),0)","v":{"v":0,"d":"0.000%"}}]
["Auswählen","Auswählen",{"$nulls":5},"Auswählen",null,"Auswählen","Auswählen",{"$nulls":3},"Auswählen","Auswählen",{"$f":"VLOOKUP(O24&P24,CHOOSE({1,2},'Hilfstab Löhne'!$A$3:$A$187&'Hilfstab Löhne'!$B$3:$B$187,'Hilfstab Löhne'!$D$3:$D$187),2,0)","v":0},0,{"v":0,"d":"0.000%"},{"$f":"ROUND(IF(S24=0,0,IF(OR(S24='Hilfstab Auswahl SOPÄ'!$L$6,S24='Hilfstab Auswahl SOPÄ'!$L$8),IF(M24>1,'Hilfstab Auswahl SOPÄ'!$M$6,'Hilfstab Auswahl SOPÄ'!$M$6*M24),IF(OR(S24='Hilfstab Auswahl SOPÄ'!$L$7,S24='Hilfstab Auswahl SOPÄ'!$L$9),IF(M24>1,'Hilfstab Auswahl SOPÄ'!$M$7,'Hilfstab Auswahl SOPÄ'!$M$7*M24),IF(S24='Hilfstab Auswahl SOPÄ'!$L$10,IF(M24>1,'Hilfstab Auswahl SOPÄ'!$M$10,'Hilfstab Auswahl SOPÄ'!$M$10*M24),IF(M24>1,'Hilfstab Auswahl SOPÄ'!$M$11,'Hilfstab Auswahl SOPÄ'!$M$11*M24))))),5)+AE24","v":{"v":0,"d":"0.000%"}},{"$f":"IF(V24=\"ja\",\"ja\",IF(O24=0,0,IF(OR(O24='Hilfstab Auswahl SOPÄ'!$C$7,O24='Hilfstab Auswahl SOPÄ'!$C$6,O24='Hilfstab Auswahl SOPÄ'!$C$13),\"ja\",\"nein\")))","v":"nein"},null,null,{"$f":"IF(OR(O24='Hilfstab Auswahl SOPÄ'!$C$11,O24='Hilfstab Auswahl SOPÄ'!$C$12)*AND(P24>1),\"* genehmigungspflichtige LK\",0)","v":0},null,"",0,{"$f":"VLOOKUP($A24,'Hilfstab Auswahl SOPÄ'!$G$6:$H$9,2,FALSE)","v":"leer"},{"$f":"IF(E24=0,\"\",IF(I24=0,\"Jahrgang fehlt\",IF(YEAR(I24)>'Hilfstab AE'!$B$16,0,IF(AND(YEAR(I24)<('Hilfstab AE'!$B$16+1),YEAR(I24)>('Hilfstab AE'!$D$16-1)),\"AE56-60\",\"AE61+\"))))","v":""},"leer ",{"$f":"IF(N24=\"ja\",IF(AND(M24>24.999%,M24<50.001%),'Hilfstab Auswahl SOPÄ'!$J$5/2,IF(M24>50%,'Hilfstab Auswahl SOPÄ'!$J$5,0)),0)","v":{"v":0,"d":"0.000%"}}]
["Auswählen","Auswählen",{"$nulls":5},"Auswählen",null,"Auswählen","Auswählen",{"$nulls":3},"Auswählen","Auswählen",{"$f":"VLOOKUP(O25&P25,CHOOSE({1,2},'Hilfstab Löhne'!$A$3:$A$187&'Hilfstab Löhne'!$B$3:$B$187,'Hilfstab Löhne'!$D$3:$D$187),2,0)","v":0},0,{"v":0,"d":"0.000%"},{"$f":"ROUND(IF(S25=0,0,IF(OR(S25='Hilfstab Auswahl SOPÄ'!$L$6,S25='Hilfstab Auswahl SOPÄ'!$L$8),IF(M25>1,'Hilfstab Auswahl SOPÄ'!$M$6,'Hilfstab Auswahl SOPÄ'!$M$6*M25),IF(OR(S25='Hilfstab Auswahl SOPÄ'!$L$7,S25='Hilfstab Auswahl SOPÄ'!$L$9),IF(M25>1,'Hilfstab Auswahl SOPÄ'!$M$7,'Hilfstab Auswahl SOPÄ'!$M$7*M25),IF(S25='Hilfstab Auswahl SOPÄ'!$L$10,IF(M25>1,'Hilfstab Auswahl SOPÄ'!$M$10,'Hilfstab Auswahl SOPÄ'!$M$10*M25),IF(M25>1,'Hilfstab Auswahl SOPÄ'!$M$11,'Hilfstab Auswahl SOPÄ'!$M$11*M25))))),5)+AE25","v":{"v":0,"d":"0.000%"}},{"$f":"IF(V25=\"ja\",\"ja\",IF(O25=0,0,IF(OR(O25='Hilfstab Auswahl SOPÄ'!$C$7,O25='Hilfstab Auswahl SOPÄ'!$C$6,O25='Hilfstab Auswahl SOPÄ'!$C$13),\"ja\",\"nein\")))","v":"nein"},null,null,{"$f":"IF(OR(O25='Hilfstab Auswahl SOPÄ'!$C$11,O25='Hilfstab Auswahl SOPÄ'!$C$12)*AND(P25>1),\"* genehmigungspflichtige LK\",0)","v":0},null,"",0,{"$f":"VLOOKUP($A25,'Hilfstab Auswahl SOPÄ'!$G$6:$H$9,2,FALSE)","v":"leer"},{"$f":"IF(E25=0,\"\",IF(I25=0,\"Jahrgang fehlt\",IF(YEAR(I25)>'Hilfstab AE'!$B$16,0,IF(AND(YEAR(I25)<('Hilfstab AE'!$B$16+1),YEAR(I25)>('Hilfstab AE'!$D$16-1)),\"AE56-60\",\"AE61+\"))))","v":""},"leer ",{"$f":"IF(N25=\"ja\",IF(AND(M25>24.999%,M25<50.001%),'Hilfstab Auswahl SOPÄ'!$J$5/2,IF(M25>50%,'Hilfstab Auswahl SOPÄ'!$J$5,0)),0)","v":{"v":0,"d":"0.000%"}}]
["Auswählen","Auswählen",{"$nulls":5},"Auswählen",null,"Auswählen","Auswählen",{"$nulls":3},"Auswählen","Auswählen",{"$f":"VLOOKUP(O26&P26,CHOOSE({1,2},'Hilfstab Löhne'!$A$3:$A$187&'Hilfstab Löhne'!$B$3:$B$187,'Hilfstab Löhne'!$D$3:$D$187),2,0)","v":0},0,{"v":0,"d":"0.000%"},{"$f":"ROUND(IF(S26=0,0,IF(OR(S26='Hilfstab Auswahl SOPÄ'!$L$6,S26='Hilfstab Auswahl SOPÄ'!$L$8),IF(M26>1,'Hilfstab Auswahl SOPÄ'!$M$6,'Hilfstab Auswahl SOPÄ'!$M$6*M26),IF(OR(S26='Hilfstab Auswahl SOPÄ'!$L$7,S26='Hilfstab Auswahl SOPÄ'!$L$9),IF(M26>1,'Hilfstab Auswahl SOPÄ'!$M$7,'Hilfstab Auswahl SOPÄ'!$M$7*M26),IF(S26='Hilfstab Auswahl SOPÄ'!$L$10,IF(M26>1,'Hilfstab Auswahl SOPÄ'!$M$10,'Hilfstab Auswahl SOPÄ'!$M$10*M26),IF(M26>1,'Hilfstab Auswahl SOPÄ'!$M$11,'Hilfstab Auswahl SOPÄ'!$M$11*M26))))),5)+AE26","v":{"v":0,"d":"0.000%"}},{"$f":"IF(V26=\"ja\",\"ja\",IF(O26=0,0,IF(OR(O26='Hilfstab Auswahl SOPÄ'!$C$7,O26='Hilfstab Auswahl SOPÄ'!$C$6,O26='Hilfstab Auswahl SOPÄ'!$C$13),\"ja\",\"nein\")))","v":"nein"},null,null,{"$f":"IF(OR(O26='Hilfstab Auswahl SOPÄ'!$C$11,O26='Hilfstab Auswahl SOPÄ'!$C$12)*AND(P26>1),\"* genehmigungspflichtige LK\",0)","v":0},null,"",0,{"$f":"VLOOKUP($A26,'Hilfstab Auswahl SOPÄ'!$G$6:$H$9,2,FALSE)","v":"leer"},{"$f":"IF(E26=0,\"\",IF(I26=0,\"Jahrgang fehlt\",IF(YEAR(I26)>'Hilfstab AE'!$B$16,0,IF(AND(YEAR(I26)<('Hilfstab AE'!$B$16+1),YEAR(I26)>('Hilfstab AE'!$D$16-1)),\"AE56-60\",\"AE61+\"))))","v":""},"leer ",{"$f":"IF(N26=\"ja\",IF(AND(M26>24.999%,M26<50.001%),'Hilfstab Auswahl SOPÄ'!$J$5/2,IF(M26>50%,'Hilfstab Auswahl SOPÄ'!$J$5,0)),0)","v":{"v":0,"d":"0.000%"}}]
["Auswählen","Auswählen",{"$nulls":5},"Auswählen",null,"Auswählen","Auswählen",{"$nulls":3},"Auswählen","Auswählen",{"$f":"VLOOKUP(O27&P27,CHOOSE({1,2},'Hilfstab Löhne'!$A$3:$A$187&'Hilfstab Löhne'!$B$3:$B$187,'Hilfstab Löhne'!$D$3:$D$187),2,0)","v":0},0,{"v":0,"d":"0.000%"},{"$f":"ROUND(IF(S27=0,0,IF(OR(S27='Hilfstab Auswahl SOPÄ'!$L$6,S27='Hilfstab Auswahl SOPÄ'!$L$8),IF(M27>1,'Hilfstab Auswahl SOPÄ'!$M$6,'Hilfstab Auswahl SOPÄ'!$M$6*M27),IF(OR(S27='Hilfstab Auswahl SOPÄ'!$L$7,S27='Hilfstab Auswahl SOPÄ'!$L$9),IF(M27>1,'Hilfstab Auswahl SOPÄ'!$M$7,'Hilfstab Auswahl SOPÄ'!$M$7*M27),IF(S27='Hilfstab Auswahl SOPÄ'!$L$10,IF(M27>1,'Hilfstab Auswahl SOPÄ'!$M$10,'Hilfstab Auswahl SOPÄ'!$M$10*M27),IF(M27>1,'Hilfstab Auswahl SOPÄ'!$M$11,'Hilfstab Auswahl SOPÄ'!$M$11*M27))))),5)+AE27","v":{"v":0,"d":"0.000%"}},{"$f":"IF(V27=\"ja\",\"ja\",IF(O27=0,0,IF(OR(O27='Hilfstab Auswahl SOPÄ'!$C$7,O27='Hilfstab Auswahl SOPÄ'!$C$6,O27='Hilfstab Auswahl SOPÄ'!$C$13),\"ja\",\"nein\")))","v":"nein"},null,null,{"$f":"IF(OR(O27='Hilfstab Auswahl SOPÄ'!$C$11,O27='Hilfstab Auswahl SOPÄ'!$C$12)*AND(P27>1),\"* genehmigungspflichtige LK\",0)","v":0},null,"",0,{"$f":"VLOOKUP($A27,'Hilfstab Auswahl SOPÄ'!$G$6:$H$9,2,FALSE)","v":"leer"},{"$f":"IF(E27=0,\"\",IF(I27=0,\"Jahrgang fehlt\",IF(YEAR(I27)>'Hilfstab AE'!$B$16,0,IF(AND(YEAR(I27)<('Hilfstab AE'!$B$16+1),YEAR(I27)>('Hilfstab AE'!$D$16-1)),\"AE56-60\",\"AE61+\"))))","v":""},"leer ",{"$f":"IF(N27=\"ja\",IF(AND(M27>24.999%,M27<50.001%),'Hilfstab Auswahl SOPÄ'!$J$5/2,IF(M27>50%,'Hilfstab Auswahl SOPÄ'!$J$5,0)),0)","v":{"v":0,"d":"0.000%"}}]
["Auswählen","Auswählen",{"$nulls":5},"Auswählen",null,"Auswählen","Auswählen",{"$nulls":3},"Auswählen","Auswählen",{"$f":"VLOOKUP(O28&P28,CHOOSE({1,2},'Hilfstab Löhne'!$A$3:$A$187&'Hilfstab Löhne'!$B$3:$B$187,'Hilfstab Löhne'!$D$3:$D$187),2,0)","v":0},0,{"v":0,"d":"0.000%"},{"$f":"ROUND(IF(S28=0,0,IF(OR(S28='Hilfstab Auswahl SOPÄ'!$L$6,S28='Hilfstab Auswahl SOPÄ'!$L$8),IF(M28>1,'Hilfstab Auswahl SOPÄ'!$M$6,'Hilfstab Auswahl SOPÄ'!$M$6*M28),IF(OR(S28='Hilfstab Auswahl SOPÄ'!$L$7,S28='Hilfstab Auswahl SOPÄ'!$L$9),IF(M28>1,'Hilfstab Auswahl SOPÄ'!$M$7,'Hilfstab Auswahl SOPÄ'!$M$7*M28),IF(S28='Hilfstab Auswahl SOPÄ'!$L$10,IF(M28>1,'Hilfstab Auswahl SOPÄ'!$M$10,'Hilfstab Auswahl SOPÄ'!$M$10*M28),IF(M28>1,'Hilfstab Auswahl SOPÄ'!$M$11,'Hilfstab Auswahl SOPÄ'!$M$11*M28))))),5)+AE28","v":{"v":0,"d":"0.000%"}},{"$f":"IF(V28=\"ja\",\"ja\",IF(O28=0,0,IF(OR(O28='Hilfstab Auswahl SOPÄ'!$C$7,O28='Hilfstab Auswahl SOPÄ'!$C$6,O28='Hilfstab Auswahl SOPÄ'!$C$13),\"ja\",\"nein\")))","v":"nein"},null,null,{"$f":"IF(OR(O28='Hilfstab Auswahl SOPÄ'!$C$11,O28='Hilfstab Auswahl SOPÄ'!$C$12)*AND(P28>1),\"* genehmigungspflichtige LK\",0)","v":0},null,"",0,{"$f":"VLOOKUP($A28,'Hilfstab Auswahl SOPÄ'!$G$6:$H$9,2,FALSE)","v":"leer"},{"$f":"IF(E28=0,\"\",IF(I28=0,\"Jahrgang fehlt\",IF(YEAR(I28)>'Hilfstab AE'!$B$16,0,IF(AND(YEAR(I28)<('Hilfstab AE'!$B$16+1),YEAR(I28)>('Hilfstab AE'!$D$16-1)),\"AE56-60\",\"AE61+\"))))","v":""},"leer ",{"$f":"IF(N28=\"ja\",IF(AND(M28>24.999%,M28<50.001%),'Hilfstab Auswahl SOPÄ'!$J$5/2,IF(M28>50%,'Hilfstab Auswahl SOPÄ'!$J$5,0)),0)","v":{"v":0,"d":"0.000%"}}]
["Auswählen","Auswählen",{"$nulls":5},"Auswählen",null,"Auswählen","Auswählen",{"$nulls":3},"Auswählen","Auswählen",{"$f":"VLOOKUP(O29&P29,CHOOSE({1,2},'Hilfstab Löhne'!$A$3:$A$187&'Hilfstab Löhne'!$B$3:$B$187,'Hilfstab Löhne'!$D$3:$D$187),2,0)","v":0},0,{"v":0,"d":"0.000%"},{"$f":"ROUND(IF(S29=0,0,IF(OR(S29='Hilfstab Auswahl SOPÄ'!$L$6,S29='Hilfstab Auswahl SOPÄ'!$L$8),IF(M29>1,'Hilfstab Auswahl SOPÄ'!$M$6,'Hilfstab Auswahl SOPÄ'!$M$6*M29),IF(OR(S29='Hilfstab Auswahl SOPÄ'!$L$7,S29='Hilfstab Auswahl SOPÄ'!$L$9),IF(M29>1,'Hilfstab Auswahl SOPÄ'!$M$7,'Hilfstab Auswahl SOPÄ'!$M$7*M29),IF(S29='Hilfstab Auswahl SOPÄ'!$L$10,IF(M29>1,'Hilfstab Auswahl SOPÄ'!$M$10,'Hilfstab Auswahl SOPÄ'!$M$10*M29),IF(M29>1,'Hilfstab Auswahl SOPÄ'!$M$11,'Hilfstab Auswahl SOPÄ'!$M$11*M29))))),5)+AE29","v":{"v":0,"d":"0.000%"}},{"$f":"IF(V29=\"ja\",\"ja\",IF(O29=0,0,IF(OR(O29='Hilfstab Auswahl SOPÄ'!$C$7,O29='Hilfstab Auswahl SOPÄ'!$C$6,O29='Hilfstab Auswahl SOPÄ'!$C$13),\"ja\",\"nein\")))","v":"nein"},null,null,{"$f":"IF(OR(O29='Hilfstab Auswahl SOPÄ'!$C$11,O29='Hilfstab Auswahl SOPÄ'!$C$12)*AND(P29>1),\"* genehmigungspflichtige LK\",0)","v":0},null,"",0,{"$f":"VLOOKUP($A29,'Hilfstab Auswahl SOPÄ'!$G$6:$H$9,2,FALSE)","v":"leer"},{"$f":"IF(E29=0,\"\",IF(I29=0,\"Jahrgang fehlt\",IF(YEAR(I29)>'Hilfstab AE'!$B$16,0,IF(AND(YEAR(I29)<('Hilfstab AE'!$B$16+1),YEAR(I29)>('Hilfstab AE'!$D$16-1)),\"AE56-60\",\"AE61+\"))))","v":""},"leer ",{"$f":"IF(N29=\"ja\",IF(AND(M29>24.999%,M29<50.001%),'Hilfstab Auswahl SOPÄ'!$J$5/2,IF(M29>50%,'Hilfstab Auswahl SOPÄ'!$J$5,0)),0)","v":{"v":0,"d":"0.000%"}}]
["Auswählen","Auswählen",{"$nulls":5},"Auswählen",null,"Auswählen","Auswählen",{"$nulls":3},"Auswählen","Auswählen",{"$f":"VLOOKUP(O30&P30,CHOOSE({1,2},'Hilfstab Löhne'!$A$3:$A$187&'Hilfstab Löhne'!$B$3:$B$187,'Hilfstab Löhne'!$D$3:$D$187),2,0)","v":0},0,{"v":0,"d":"0.000%"},{"$f":"ROUND(IF(S30=0,0,IF(OR(S30='Hilfstab Auswahl SOPÄ'!$L$6,S30='Hilfstab Auswahl SOPÄ'!$L$8),IF(M30>1,'Hilfstab Auswahl SOPÄ'!$M$6,'Hilfstab Auswahl SOPÄ'!$M$6*M30),IF(OR(S30='Hilfstab Auswahl SOPÄ'!$L$7,S30='Hilfstab Auswahl SOPÄ'!$L$9),IF(M30>1,'Hilfstab Auswahl SOPÄ'!$M$7,'Hilfstab Auswahl SOPÄ'!$M$7*M30),IF(S30='Hilfstab Auswahl SOPÄ'!$L$10,IF(M30>1,'Hilfstab Auswahl SOPÄ'!$M$10,'Hilfstab Auswahl SOPÄ'!$M$10*M30),IF(M30>1,'Hilfstab Auswahl SOPÄ'!$M$11,'Hilfstab Auswahl SOPÄ'!$M$11*M30))))),5)+AE30","v":{"v":0,"d":"0.000%"}},{"$f":"IF(V30=\"ja\",\"ja\",IF(O30=0,0,IF(OR(O30='Hilfstab Auswahl SOPÄ'!$C$7,O30='Hilfstab Auswahl SOPÄ'!$C$6,O30='Hilfstab Auswahl SOPÄ'!$C$13),\"ja\",\"nein\")))","v":"nein"},null,null,{"$f":"IF(OR(O30='Hilfstab Auswahl SOPÄ'!$C$11,O30='Hilfstab Auswahl SOPÄ'!$C$12)*AND(P30>1),\"* genehmigungspflichtige LK\",0)","v":0},null,"",0,{"$f":"VLOOKUP($A30,'Hilfstab Auswahl SOPÄ'!$G$6:$H$9,2,FALSE)","v":"leer"},{"$f":"IF(E30=0,\"\",IF(I30=0,\"Jahrgang fehlt\",IF(YEAR(I30)>'Hilfstab AE'!$B$16,0,IF(AND(YEAR(I30)<('Hilfstab AE'!$B$16+1),YEAR(I30)>('Hilfstab AE'!$D$16-1)),\"AE56-60\",\"AE61+\"))))","v":""},"leer ",{"$f":"IF(N30=\"ja\",IF(AND(M30>24.999%,M30<50.001%),'Hilfstab Auswahl SOPÄ'!$J$5/2,IF(M30>50%,'Hilfstab Auswahl SOPÄ'!$J$5,0)),0)","v":{"v":0,"d":"0.000%"}}]
["Auswählen","Auswählen",{"$nulls":5},"Auswählen",null,"Auswählen","Auswählen",{"$nulls":3},"Auswählen","Auswählen",{"$f":"VLOOKUP(O31&P31,CHOOSE({1,2},'Hilfstab Löhne'!$A$3:$A$187&'Hilfstab Löhne'!$B$3:$B$187,'Hilfstab Löhne'!$D$3:$D$187),2,0)","v":0},0,{"v":0,"d":"0.000%"},{"$f":"ROUND(IF(S31=0,0,IF(OR(S31='Hilfstab Auswahl SOPÄ'!$L$6,S31='Hilfstab Auswahl SOPÄ'!$L$8),IF(M31>1,'Hilfstab Auswahl SOPÄ'!$M$6,'Hilfstab Auswahl SOPÄ'!$M$6*M31),IF(OR(S31='Hilfstab Auswahl SOPÄ'!$L$7,S31='Hilfstab Auswahl SOPÄ'!$L$9),IF(M31>1,'Hilfstab Auswahl SOPÄ'!$M$7,'Hilfstab Auswahl SOPÄ'!$M$7*M31),IF(S31='Hilfstab Auswahl SOPÄ'!$L$10,IF(M31>1,'Hilfstab Auswahl SOPÄ'!$M$10,'Hilfstab Auswahl SOPÄ'!$M$10*M31),IF(M31>1,'Hilfstab Auswahl SOPÄ'!$M$11,'Hilfstab Auswahl SOPÄ'!$M$11*M31))))),5)+AE31","v":{"v":0,"d":"0.000%"}},{"$f":"IF(V31=\"ja\",\"ja\",IF(O31=0,0,IF(OR(O31='Hilfstab Auswahl SOPÄ'!$C$7,O31='Hilfstab Auswahl SOPÄ'!$C$6,O31='Hilfstab Auswahl SOPÄ'!$C$13),\"ja\",\"nein\")))","v":"nein"},null,null,{"$f":"IF(OR(O31='Hilfstab Auswahl SOPÄ'!$C$11,O31='Hilfstab Auswahl SOPÄ'!$C$12)*AND(P31>1),\"* genehmigungspflichtige LK\",0)","v":0},null,"",0,{"$f":"VLOOKUP($A31,'Hilfstab Auswahl SOPÄ'!$G$6:$H$9,2,FALSE)","v":"leer"},{"$f":"IF(E31=0,\"\",IF(I31=0,\"Jahrgang fehlt\",IF(YEAR(I31)>'Hilfstab AE'!$B$16,0,IF(AND(YEAR(I31)<('Hilfstab AE'!$B$16+1),YEAR(I31)>('Hilfstab AE'!$D$16-1)),\"AE56-60\",\"AE61+\"))))","v":""},"leer ",{"$f":"IF(N31=\"ja\",IF(AND(M31>24.999%,M31<50.001%),'Hilfstab Auswahl SOPÄ'!$J$5/2,IF(M31>50%,'Hilfstab Auswahl SOPÄ'!$J$5,0)),0)","v":{"v":0,"d":"0.000%"}}]
["Auswählen","Auswählen",{"$nulls":5},"Auswählen",null,"Auswählen","Auswählen",{"$nulls":3},"Auswählen","Auswählen",{"$f":"VLOOKUP(O32&P32,CHOOSE({1,2},'Hilfstab Löhne'!$A$3:$A$187&'Hilfstab Löhne'!$B$3:$B$187,'Hilfstab Löhne'!$D$3:$D$187),2,0)","v":0},0,{"v":0,"d":"0.000%"},{"$f":"ROUND(IF(S32=0,0,IF(OR(S32='Hilfstab Auswahl SOPÄ'!$L$6,S32='Hilfstab Auswahl SOPÄ'!$L$8),IF(M32>1,'Hilfstab Auswahl SOPÄ'!$M$6,'Hilfstab Auswahl SOPÄ'!$M$6*M32),IF(OR(S32='Hilfstab Auswahl SOPÄ'!$L$7,S32='Hilfstab Auswahl SOPÄ'!$L$9),IF(M32>1,'Hilfstab Auswahl SOPÄ'!$M$7,'Hilfstab Auswahl SOPÄ'!$M$7*M32),IF(S32='Hilfstab Auswahl SOPÄ'!$L$10,IF(M32>1,'Hilfstab Auswahl SOPÄ'!$M$10,'Hilfstab Auswahl SOPÄ'!$M$10*M32),IF(M32>1,'Hilfstab Auswahl SOPÄ'!$M$11,'Hilfstab Auswahl SOPÄ'!$M$11*M32))))),5)+AE32","v":{"v":0,"d":"0.000%"}},{"$f":"IF(V32=\"ja\",\"ja\",IF(O32=0,0,IF(OR(O32='Hilfstab Auswahl SOPÄ'!$C$7,O32='Hilfstab Auswahl SOPÄ'!$C$6,O32='Hilfstab Auswahl SOPÄ'!$C$13),\"ja\",\"nein\")))","v":"nein"},null,null,{"$f":"IF(OR(O32='Hilfstab Auswahl SOPÄ'!$C$11,O32='Hilfstab Auswahl SOPÄ'!$C$12)*AND(P32>1),\"* genehmigungspflichtige LK\",0)","v":0},null,"",0,{"$f":"VLOOKUP($A32,'Hilfstab Auswahl SOPÄ'!$G$6:$H$9,2,FALSE)","v":"leer"},{"$f":"IF(E32=0,\"\",IF(I32=0,\"Jahrgang fehlt\",IF(YEAR(I32)>'Hilfstab AE'!$B$16,0,IF(AND(YEAR(I32)<('Hilfstab AE'!$B$16+1),YEAR(I32)>('Hilfstab AE'!$D$16-1)),\"AE56-60\",\"AE61+\"))))","v":""},"leer ",{"$f":"IF(N32=\"ja\",IF(AND(M32>24.999%,M32<50.001%),'Hilfstab Auswahl SOPÄ'!$J$5/2,IF(M32>50%,'Hilfstab Auswahl SOPÄ'!$J$5,0)),0)","v":{"v":0,"d":"0.000%"}}]
["Auswählen","Auswählen",{"$nulls":5},"Auswählen",null,"Auswählen","Auswählen",{"$nulls":3},"Auswählen","Auswählen",{"$f":"VLOOKUP(O33&P33,CHOOSE({1,2},'Hilfstab Löhne'!$A$3:$A$187&'Hilfstab Löhne'!$B$3:$B$187,'Hilfstab Löhne'!$D$3:$D$187),2,0)","v":0},0,{"v":0,"d":"0.000%"},{"$f":"ROUND(IF(S33=0,0,IF(OR(S33='Hilfstab Auswahl SOPÄ'!$L$6,S33='Hilfstab Auswahl SOPÄ'!$L$8),IF(M33>1,'Hilfstab Auswahl SOPÄ'!$M$6,'Hilfstab Auswahl SOPÄ'!$M$6*M33),IF(OR(S33='Hilfstab Auswahl SOPÄ'!$L$7,S33='Hilfstab Auswahl SOPÄ'!$L$9),IF(M33>1,'Hilfstab Auswahl SOPÄ'!$M$7,'Hilfstab Auswahl SOPÄ'!$M$7*M33),IF(S33='Hilfstab Auswahl SOPÄ'!$L$10,IF(M33>1,'Hilfstab Auswahl SOPÄ'!$M$10,'Hilfstab Auswahl SOPÄ'!$M$10*M33),IF(M33>1,'Hilfstab Auswahl SOPÄ'!$M$11,'Hilfstab Auswahl SOPÄ'!$M$11*M33))))),5)+AE33","v":{"v":0,"d":"0.000%"}},{"$f":"IF(V33=\"ja\",\"ja\",IF(O33=0,0,IF(OR(O33='Hilfstab Auswahl SOPÄ'!$C$7,O33='Hilfstab Auswahl SOPÄ'!$C$6,O33='Hilfstab Auswahl SOPÄ'!$C$13),\"ja\",\"nein\")))","v":"nein"},null,null,{"$f":"IF(OR(O33='Hilfstab Auswahl SOPÄ'!$C$11,O33='Hilfstab Auswahl SOPÄ'!$C$12)*AND(P33>1),\"* genehmigungspflichtige LK\",0)","v":0},null,"",0,{"$f":"VLOOKUP($A33,'Hilfstab Auswahl SOPÄ'!$G$6:$H$9,2,FALSE)","v":"leer"},{"$f":"IF(E33=0,\"\",IF(I33=0,\"Jahrgang fehlt\",IF(YEAR(I33)>'Hilfstab AE'!$B$16,0,IF(AND(YEAR(I33)<('Hilfstab AE'!$B$16+1),YEAR(I33)>('Hilfstab AE'!$D$16-1)),\"AE56-60\",\"AE61+\"))))","v":""},"leer ",{"$f":"IF(N33=\"ja\",IF(AND(M33>24.999%,M33<50.001%),'Hilfstab Auswahl SOPÄ'!$J$5/2,IF(M33>50%,'Hilfstab Auswahl SOPÄ'!$J$5,0)),0)","v":{"v":0,"d":"0.000%"}}]
["Auswählen","Auswählen",{"$nulls":5},"Auswählen",null,"Auswählen","Auswählen",{"$nulls":3},"Auswählen","Auswählen",{"$f":"VLOOKUP(O34&P34,CHOOSE({1,2},'Hilfstab Löhne'!$A$3:$A$187&'Hilfstab Löhne'!$B$3:$B$187,'Hilfstab Löhne'!$D$3:$D$187),2,0)","v":0},0,{"v":0,"d":"0.000%"},{"$f":"ROUND(IF(S34=0,0,IF(OR(S34='Hilfstab Auswahl SOPÄ'!$L$6,S34='Hilfstab Auswahl SOPÄ'!$L$8),IF(M34>1,'Hilfstab Auswahl SOPÄ'!$M$6,'Hilfstab Auswahl SOPÄ'!$M$6*M34),IF(OR(S34='Hilfstab Auswahl SOPÄ'!$L$7,S34='Hilfstab Auswahl SOPÄ'!$L$9),IF(M34>1,'Hilfstab Auswahl SOPÄ'!$M$7,'Hilfstab Auswahl SOPÄ'!$M$7*M34),IF(S34='Hilfstab Auswahl SOPÄ'!$L$10,IF(M34>1,'Hilfstab Auswahl SOPÄ'!$M$10,'Hilfstab Auswahl SOPÄ'!$M$10*M34),IF(M34>1,'Hilfstab Auswahl SOPÄ'!$M$11,'Hilfstab Auswahl SOPÄ'!$M$11*M34))))),5)+AE34","v":{"v":0,"d":"0.000%"}},{"$f":"IF(V34=\"ja\",\"ja\",IF(O34=0,0,IF(OR(O34='Hilfstab Auswahl SOPÄ'!$C$7,O34='Hilfstab Auswahl SOPÄ'!$C$6,O34='Hilfstab Auswahl SOPÄ'!$C$13),\"ja\",\"nein\")))","v":"nein"},null,null,{"$f":"IF(OR(O34='Hilfstab Auswahl SOPÄ'!$C$11,O34='Hilfstab Auswahl SOPÄ'!$C$12)*AND(P34>1),\"* genehmigungspflichtige LK\",0)","v":0},null,"",0,{"$f":"VLOOKUP($A34,'Hilfstab Auswahl SOPÄ'!$G$6:$H$9,2,FALSE)","v":"leer"},{"$f":"IF(E34=0,\"\",IF(I34=0,\"Jahrgang fehlt\",IF(YEAR(I34)>'Hilfstab AE'!$B$16,0,IF(AND(YEAR(I34)<('Hilfstab AE'!$B$16+1),YEAR(I34)>('Hilfstab AE'!$D$16-1)),\"AE56-60\",\"AE61+\"))))","v":""},"leer ",{"$f":"IF(N34=\"ja\",IF(AND(M34>24.999%,M34<50.001%),'Hilfstab Auswahl SOPÄ'!$J$5/2,IF(M34>50%,'Hilfstab Auswahl SOPÄ'!$J$5,0)),0)","v":{"v":0,"d":"0.000%"}}]
["Auswählen","Auswählen",{"$nulls":5},"Auswählen",null,"Auswählen","Auswählen",{"$nulls":3},"Auswählen","Auswählen",{"$f":"VLOOKUP(O35&P35,CHOOSE({1,2},'Hilfstab Löhne'!$A$3:$A$187&'Hilfstab Löhne'!$B$3:$B$187,'Hilfstab Löhne'!$D$3:$D$187),2,0)","v":0},0,{"v":0,"d":"0.000%"},{"$f":"ROUND(IF(S35=0,0,IF(OR(S35='Hilfstab Auswahl SOPÄ'!$L$6,S35='Hilfstab Auswahl SOPÄ'!$L$8),IF(M35>1,'Hilfstab Auswahl SOPÄ'!$M$6,'Hilfstab Auswahl SOPÄ'!$M$6*M35),IF(OR(S35='Hilfstab Auswahl SOPÄ'!$L$7,S35='Hilfstab Auswahl SOPÄ'!$L$9),IF(M35>1,'Hilfstab Auswahl SOPÄ'!$M$7,'Hilfstab Auswahl SOPÄ'!$M$7*M35),IF(S35='Hilfstab Auswahl SOPÄ'!$L$10,IF(M35>1,'Hilfstab Auswahl SOPÄ'!$M$10,'Hilfstab Auswahl SOPÄ'!$M$10*M35),IF(M35>1,'Hilfstab Auswahl SOPÄ'!$M$11,'Hilfstab Auswahl SOPÄ'!$M$11*M35))))),5)+AE35","v":{"v":0,"d":"0.000%"}},{"$f":"IF(V35=\"ja\",\"ja\",IF(O35=0,0,IF(OR(O35='Hilfstab Auswahl SOPÄ'!$C$7,O35='Hilfstab Auswahl SOPÄ'!$C$6,O35='Hilfstab Auswahl SOPÄ'!$C$13),\"ja\",\"nein\")))","v":"nein"},null,null,{"$f":"IF(OR(O35='Hilfstab Auswahl SOPÄ'!$C$11,O35='Hilfstab Auswahl SOPÄ'!$C$12)*AND(P35>1),\"* genehmigungspflichtige LK\",0)","v":0},null,"",0,{"$f":"VLOOKUP($A35,'Hilfstab Auswahl SOPÄ'!$G$6:$H$9,2,FALSE)","v":"leer"},{"$f":"IF(E35=0,\"\",IF(I35=0,\"Jahrgang fehlt\",IF(YEAR(I35)>'Hilfstab AE'!$B$16,0,IF(AND(YEAR(I35)<('Hilfstab AE'!$B$16+1),YEAR(I35)>('Hilfstab AE'!$D$16-1)),\"AE56-60\",\"AE61+\"))))","v":""},"leer ",{"$f":"IF(N35=\"ja\",IF(AND(M35>24.999%,M35<50.001%),'Hilfstab Auswahl SOPÄ'!$J$5/2,IF(M35>50%,'Hilfstab Auswahl SOPÄ'!$J$5,0)),0)","v":{"v":0,"d":"0.000%"}}]
["Auswählen","Auswählen",{"$nulls":5},"Auswählen",null,"Auswählen","Auswählen",{"$nulls":3},"Auswählen","Auswählen",{"$f":"VLOOKUP(O36&P36,CHOOSE({1,2},'Hilfstab Löhne'!$A$3:$A$187&'Hilfstab Löhne'!$B$3:$B$187,'Hilfstab Löhne'!$D$3:$D$187),2,0)","v":0},0,{"v":0,"d":"0.000%"},{"$f":"ROUND(IF(S36=0,0,IF(OR(S36='Hilfstab Auswahl SOPÄ'!$L$6,S36='Hilfstab Auswahl SOPÄ'!$L$8),IF(M36>1,'Hilfstab Auswahl SOPÄ'!$M$6,'Hilfstab Auswahl SOPÄ'!$M$6*M36),IF(OR(S36='Hilfstab Auswahl SOPÄ'!$L$7,S36='Hilfstab Auswahl SOPÄ'!$L$9),IF(M36>1,'Hilfstab Auswahl SOPÄ'!$M$7,'Hilfstab Auswahl SOPÄ'!$M$7*M36),IF(S36='Hilfstab Auswahl SOPÄ'!$L$10,IF(M36>1,'Hilfstab Auswahl SOPÄ'!$M$10,'Hilfstab Auswahl SOPÄ'!$M$10*M36),IF(M36>1,'Hilfstab Auswahl SOPÄ'!$M$11,'Hilfstab Auswahl SOPÄ'!$M$11*M36))))),5)+AE36","v":{"v":0,"d":"0.000%"}},{"$f":"IF(V36=\"ja\",\"ja\",IF(O36=0,0,IF(OR(O36='Hilfstab Auswahl SOPÄ'!$C$7,O36='Hilfstab Auswahl SOPÄ'!$C$6,O36='Hilfstab Auswahl SOPÄ'!$C$13),\"ja\",\"nein\")))","v":"nein"},null,null,{"$f":"IF(OR(O36='Hilfstab Auswahl SOPÄ'!$C$11,O36='Hilfstab Auswahl SOPÄ'!$C$12)*AND(P36>1),\"* genehmigungspflichtige LK\",0)","v":0},null,"",0,{"$f":"VLOOKUP($A36,'Hilfstab Auswahl SOPÄ'!$G$6:$H$9,2,FALSE)","v":"leer"},{"$f":"IF(E36=0,\"\",IF(I36=0,\"Jahrgang fehlt\",IF(YEAR(I36)>'Hilfstab AE'!$B$16,0,IF(AND(YEAR(I36)<('Hilfstab AE'!$B$16+1),YEAR(I36)>('Hilfstab AE'!$D$16-1)),\"AE56-60\",\"AE61+\"))))","v":""},"leer ",{"$f":"IF(N36=\"ja\",IF(AND(M36>24.999%,M36<50.001%),'Hilfstab Auswahl SOPÄ'!$J$5/2,IF(M36>50%,'Hilfstab Auswahl SOPÄ'!$J$5,0)),0)","v":{"v":0,"d":"0.000%"}}]
["Auswählen","Auswählen",{"$nulls":5},"Auswählen",null,"Auswählen","Auswählen",{"$nulls":3},"Auswählen","Auswählen",{"$f":"VLOOKUP(O37&P37,CHOOSE({1,2},'Hilfstab Löhne'!$A$3:$A$187&'Hilfstab Löhne'!$B$3:$B$187,'Hilfstab Löhne'!$D$3:$D$187),2,0)","v":0},0,{"v":0,"d":"0.000%"},{"$f":"ROUND(IF(S37=0,0,IF(OR(S37='Hilfstab Auswahl SOPÄ'!$L$6,S37='Hilfstab Auswahl SOPÄ'!$L$8),IF(M37>1,'Hilfstab Auswahl SOPÄ'!$M$6,'Hilfstab Auswahl SOPÄ'!$M$6*M37),IF(OR(S37='Hilfstab Auswahl SOPÄ'!$L$7,S37='Hilfstab Auswahl SOPÄ'!$L$9),IF(M37>1,'Hilfstab Auswahl SOPÄ'!$M$7,'Hilfstab Auswahl SOPÄ'!$M$7*M37),IF(S37='Hilfstab Auswahl SOPÄ'!$L$10,IF(M37>1,'Hilfstab Auswahl SOPÄ'!$M$10,'Hilfstab Auswahl SOPÄ'!$M$10*M37),IF(M37>1,'Hilfstab Auswahl SOPÄ'!$M$11,'Hilfstab Auswahl SOPÄ'!$M$11*M37))))),5)+AE37","v":{"v":0,"d":"0.000%"}},{"$f":"IF(V37=\"ja\",\"ja\",IF(O37=0,0,IF(OR(O37='Hilfstab Auswahl SOPÄ'!$C$7,O37='Hilfstab Auswahl SOPÄ'!$C$6,O37='Hilfstab Auswahl SOPÄ'!$C$13),\"ja\",\"nein\")))","v":"nein"},null,null,{"$f":"IF(OR(O37='Hilfstab Auswahl SOPÄ'!$C$11,O37='Hilfstab Auswahl SOPÄ'!$C$12)*AND(P37>1),\"* genehmigungspflichtige LK\",0)","v":0},null,"",0,{"$f":"VLOOKUP($A37,'Hilfstab Auswahl SOPÄ'!$G$6:$H$9,2,FALSE)","v":"leer"},{"$f":"IF(E37=0,\"\",IF(I37=0,\"Jahrgang fehlt\",IF(YEAR(I37)>'Hilfstab AE'!$B$16,0,IF(AND(YEAR(I37)<('Hilfstab AE'!$B$16+1),YEAR(I37)>('Hilfstab AE'!$D$16-1)),\"AE56-60\",\"AE61+\"))))","v":""},"leer ",{"$f":"IF(N37=\"ja\",IF(AND(M37>24.999%,M37<50.001%),'Hilfstab Auswahl SOPÄ'!$J$5/2,IF(M37>50%,'Hilfstab Auswahl SOPÄ'!$J$5,0)),0)","v":{"v":0,"d":"0.000%"}}]
["Auswählen","Auswählen",{"$nulls":5},"Auswählen",null,"Auswählen","Auswählen",{"$nulls":3},"Auswählen","Auswählen",{"$f":"VLOOKUP(O38&P38,CHOOSE({1,2},'Hilfstab Löhne'!$A$3:$A$187&'Hilfstab Löhne'!$B$3:$B$187,'Hilfstab Löhne'!$D$3:$D$187),2,0)","v":0},0,{"v":0,"d":"0.000%"},{"$f":"ROUND(IF(S38=0,0,IF(OR(S38='Hilfstab Auswahl SOPÄ'!$L$6,S38='Hilfstab Auswahl SOPÄ'!$L$8),IF(M38>1,'Hilfstab Auswahl SOPÄ'!$M$6,'Hilfstab Auswahl SOPÄ'!$M$6*M38),IF(OR(S38='Hilfstab Auswahl SOPÄ'!$L$7,S38='Hilfstab Auswahl SOPÄ'!$L$9),IF(M38>1,'Hilfstab Auswahl SOPÄ'!$M$7,'Hilfstab Auswahl SOPÄ'!$M$7*M38),IF(S38='Hilfstab Auswahl SOPÄ'!$L$10,IF(M38>1,'Hilfstab Auswahl SOPÄ'!$M$10,'Hilfstab Auswahl SOPÄ'!$M$10*M38),IF(M38>1,'Hilfstab Auswahl SOPÄ'!$M$11,'Hilfstab Auswahl SOPÄ'!$M$11*M38))))),5)+AE38","v":{"v":0,"d":"0.000%"}},{"$f":"IF(V38=\"ja\",\"ja\",IF(O38=0,0,IF(OR(O38='Hilfstab Auswahl SOPÄ'!$C$7,O38='Hilfstab Auswahl SOPÄ'!$C$6,O38='Hilfstab Auswahl SOPÄ'!$C$13),\"ja\",\"nein\")))","v":"nein"},null,null,{"$f":"IF(OR(O38='Hilfstab Auswahl SOPÄ'!$C$11,O38='Hilfstab Auswahl SOPÄ'!$C$12)*AND(P38>1),\"* genehmigungspflichtige LK\",0)","v":0},null,"",0,{"$f":"VLOOKUP($A38,'Hilfstab Auswahl SOPÄ'!$G$6:$H$9,2,FALSE)","v":"leer"},{"$f":"IF(E38=0,\"\",IF(I38=0,\"Jahrgang fehlt\",IF(YEAR(I38)>'Hilfstab AE'!$B$16,0,IF(AND(YEAR(I38)<('Hilfstab AE'!$B$16+1),YEAR(I38)>('Hilfstab AE'!$D$16-1)),\"AE56-60\",\"AE61+\"))))","v":""},"leer ",{"$f":"IF(N38=\"ja\",IF(AND(M38>24.999%,M38<50.001%),'Hilfstab Auswahl SOPÄ'!$J$5/2,IF(M38>50%,'Hilfstab Auswahl SOPÄ'!$J$5,0)),0)","v":{"v":0,"d":"0.000%"}}]
["Auswählen","Auswählen",{"$nulls":5},"Auswählen",null,"Auswählen","Auswählen",{"$nulls":3},"Auswählen","Auswählen",{"$f":"VLOOKUP(O39&P39,CHOOSE({1,2},'Hilfstab Löhne'!$A$3:$A$187&'Hilfstab Löhne'!$B$3:$B$187,'Hilfstab Löhne'!$D$3:$D$187),2,0)","v":0},0,{"v":0,"d":"0.000%"},{"$f":"ROUND(IF(S39=0,0,IF(OR(S39='Hilfstab Auswahl SOPÄ'!$L$6,S39='Hilfstab Auswahl SOPÄ'!$L$8),IF(M39>1,'Hilfstab Auswahl SOPÄ'!$M$6,'Hilfstab Auswahl SOPÄ'!$M$6*M39),IF(OR(S39='Hilfstab Auswahl SOPÄ'!$L$7,S39='Hilfstab Auswahl SOPÄ'!$L$9),IF(M39>1,'Hilfstab Auswahl SOPÄ'!$M$7,'Hilfstab Auswahl SOPÄ'!$M$7*M39),IF(S39='Hilfstab Auswahl SOPÄ'!$L$10,IF(M39>1,'Hilfstab Auswahl SOPÄ'!$M$10,'Hilfstab Auswahl SOPÄ'!$M$10*M39),IF(M39>1,'Hilfstab Auswahl SOPÄ'!$M$11,'Hilfstab Auswahl SOPÄ'!$M$11*M39))))),5)+AE39","v":{"v":0,"d":"0.000%"}},{"$f":"IF(V39=\"ja\",\"ja\",IF(O39=0,0,IF(OR(O39='Hilfstab Auswahl SOPÄ'!$C$7,O39='Hilfstab Auswahl SOPÄ'!$C$6,O39='Hilfstab Auswahl SOPÄ'!$C$13),\"ja\",\"nein\")))","v":"nein"},null,null,{"$f":"IF(OR(O39='Hilfstab Auswahl SOPÄ'!$C$11,O39='Hilfstab Auswahl SOPÄ'!$C$12)*AND(P39>1),\"* genehmigungspflichtige LK\",0)","v":0},null,"",0,{"$f":"VLOOKUP($A39,'Hilfstab Auswahl SOPÄ'!$G$6:$H$9,2,FALSE)","v":"leer"},{"$f":"IF(E39=0,\"\",IF(I39=0,\"Jahrgang fehlt\",IF(YEAR(I39)>'Hilfstab AE'!$B$16,0,IF(AND(YEAR(I39)<('Hilfstab AE'!$B$16+1),YEAR(I39)>('Hilfstab AE'!$D$16-1)),\"AE56-60\",\"AE61+\"))))","v":""},"leer ",{"$f":"IF(N39=\"ja\",IF(AND(M39>24.999%,M39<50.001%),'Hilfstab Auswahl SOPÄ'!$J$5/2,IF(M39>50%,'Hilfstab Auswahl SOPÄ'!$J$5,0)),0)","v":{"v":0,"d":"0.000%"}}]
["Auswählen","Auswählen",{"$nulls":5},"Auswählen",null,"Auswählen","Auswählen",{"$nulls":3},"Auswählen","Auswählen",{"$f":"VLOOKUP(O40&P40,CHOOSE({1,2},'Hilfstab Löhne'!$A$3:$A$187&'Hilfstab Löhne'!$B$3:$B$187,'Hilfstab Löhne'!$D$3:$D$187),2,0)","v":0},0,{"v":0,"d":"0.000%"},{"$f":"ROUND(IF(S40=0,0,IF(OR(S40='Hilfstab Auswahl SOPÄ'!$L$6,S40='Hilfstab Auswahl SOPÄ'!$L$8),IF(M40>1,'Hilfstab Auswahl SOPÄ'!$M$6,'Hilfstab Auswahl SOPÄ'!$M$6*M40),IF(OR(S40='Hilfstab Auswahl SOPÄ'!$L$7,S40='Hilfstab Auswahl SOPÄ'!$L$9),IF(M40>1,'Hilfstab Auswahl SOPÄ'!$M$7,'Hilfstab Auswahl SOPÄ'!$M$7*M40),IF(S40='Hilfstab Auswahl SOPÄ'!$L$10,IF(M40>1,'Hilfstab Auswahl SOPÄ'!$M$10,'Hilfstab Auswahl SOPÄ'!$M$10*M40),IF(M40>1,'Hilfstab Auswahl SOPÄ'!$M$11,'Hilfstab Auswahl SOPÄ'!$M$11*M40))))),5)+AE40","v":{"v":0,"d":"0.000%"}},{"$f":"IF(V40=\"ja\",\"ja\",IF(O40=0,0,IF(OR(O40='Hilfstab Auswahl SOPÄ'!$C$7,O40='Hilfstab Auswahl SOPÄ'!$C$6,O40='Hilfstab Auswahl SOPÄ'!$C$13),\"ja\",\"nein\")))","v":"nein"},null,null,{"$f":"IF(OR(O40='Hilfstab Auswahl SOPÄ'!$C$11,O40='Hilfstab Auswahl SOPÄ'!$C$12)*AND(P40>1),\"* genehmigungspflichtige LK\",0)","v":0},null,"",0,{"$f":"VLOOKUP($A40,'Hilfstab Auswahl SOPÄ'!$G$6:$H$9,2,FALSE)","v":"leer"},{"$f":"IF(E40=0,\"\",IF(I40=0,\"Jahrgang fehlt\",IF(YEAR(I40)>'Hilfstab AE'!$B$16,0,IF(AND(YEAR(I40)<('Hilfstab AE'!$B$16+1),YEAR(I40)>('Hilfstab AE'!$D$16-1)),\"AE56-60\",\"AE61+\"))))","v":""},"leer ",{"$f":"IF(N40=\"ja\",IF(AND(M40>24.999%,M40<50.001%),'Hilfstab Auswahl SOPÄ'!$J$5/2,IF(M40>50%,'Hilfstab Auswahl SOPÄ'!$J$5,0)),0)","v":{"v":0,"d":"0.000%"}}]
["Auswählen","Auswählen",{"$nulls":5},"Auswählen",null,"Auswählen","Auswählen",{"$nulls":3},"Auswählen","Auswählen",{"$f":"VLOOKUP(O41&P41,CHOOSE({1,2},'Hilfstab Löhne'!$A$3:$A$187&'Hilfstab Löhne'!$B$3:$B$187,'Hilfstab Löhne'!$D$3:$D$187),2,0)","v":0},0,{"v":0,"d":"0.000%"},{"$f":"ROUND(IF(S41=0,0,IF(OR(S41='Hilfstab Auswahl SOPÄ'!$L$6,S41='Hilfstab Auswahl SOPÄ'!$L$8),IF(M41>1,'Hilfstab Auswahl SOPÄ'!$M$6,'Hilfstab Auswahl SOPÄ'!$M$6*M41),IF(OR(S41='Hilfstab Auswahl SOPÄ'!$L$7,S41='Hilfstab Auswahl SOPÄ'!$L$9),IF(M41>1,'Hilfstab Auswahl SOPÄ'!$M$7,'Hilfstab Auswahl SOPÄ'!$M$7*M41),IF(S41='Hilfstab Auswahl SOPÄ'!$L$10,IF(M41>1,'Hilfstab Auswahl SOPÄ'!$M$10,'Hilfstab Auswahl SOPÄ'!$M$10*M41),IF(M41>1,'Hilfstab Auswahl SOPÄ'!$M$11,'Hilfstab Auswahl SOPÄ'!$M$11*M41))))),5)+AE41","v":{"v":0,"d":"0.000%"}},{"$f":"IF(V41=\"ja\",\"ja\",IF(O41=0,0,IF(OR(O41='Hilfstab Auswahl SOPÄ'!$C$7,O41='Hilfstab Auswahl SOPÄ'!$C$6,O41='Hilfstab Auswahl SOPÄ'!$C$13),\"ja\",\"nein\")))","v":"nein"},null,null,{"$f":"IF(OR(O41='Hilfstab Auswahl SOPÄ'!$C$11,O41='Hilfstab Auswahl SOPÄ'!$C$12)*AND(P41>1),\"* genehmigungspflichtige LK\",0)","v":0},null,"",0,{"$f":"VLOOKUP($A41,'Hilfstab Auswahl SOPÄ'!$G$6:$H$9,2,FALSE)","v":"leer"},{"$f":"IF(E41=0,\"\",IF(I41=0,\"Jahrgang fehlt\",IF(YEAR(I41)>'Hilfstab AE'!$B$16,0,IF(AND(YEAR(I41)<('Hilfstab AE'!$B$16+1),YEAR(I41)>('Hilfstab AE'!$D$16-1)),\"AE56-60\",\"AE61+\"))))","v":""},"leer ",{"$f":"IF(N41=\"ja\",IF(AND(M41>24.999%,M41<50.001%),'Hilfstab Auswahl SOPÄ'!$J$5/2,IF(M41>50%,'Hilfstab Auswahl SOPÄ'!$J$5,0)),0)","v":{"v":0,"d":"0.000%"}}]
["Auswählen","Auswählen",{"$nulls":5},"Auswählen",null,"Auswählen","Auswählen",{"$nulls":3},"Auswählen","Auswählen",{"$f":"VLOOKUP(O42&P42,CHOOSE({1,2},'Hilfstab Löhne'!$A$3:$A$187&'Hilfstab Löhne'!$B$3:$B$187,'Hilfstab Löhne'!$D$3:$D$187),2,0)","v":0},0,{"v":0,"d":"0.000%"},{"$f":"ROUND(IF(S42=0,0,IF(OR(S42='Hilfstab Auswahl SOPÄ'!$L$6,S42='Hilfstab Auswahl SOPÄ'!$L$8),IF(M42>1,'Hilfstab Auswahl SOPÄ'!$M$6,'Hilfstab Auswahl SOPÄ'!$M$6*M42),IF(OR(S42='Hilfstab Auswahl SOPÄ'!$L$7,S42='Hilfstab Auswahl SOPÄ'!$L$9),IF(M42>1,'Hilfstab Auswahl SOPÄ'!$M$7,'Hilfstab Auswahl SOPÄ'!$M$7*M42),IF(S42='Hilfstab Auswahl SOPÄ'!$L$10,IF(M42>1,'Hilfstab Auswahl SOPÄ'!$M$10,'Hilfstab Auswahl SOPÄ'!$M$10*M42),IF(M42>1,'Hilfstab Auswahl SOPÄ'!$M$11,'Hilfstab Auswahl SOPÄ'!$M$11*M42))))),5)+AE42","v":{"v":0,"d":"0.000%"}},{"$f":"IF(V42=\"ja\",\"ja\",IF(O42=0,0,IF(OR(O42='Hilfstab Auswahl SOPÄ'!$C$7,O42='Hilfstab Auswahl SOPÄ'!$C$6,O42='Hilfstab Auswahl SOPÄ'!$C$13),\"ja\",\"nein\")))","v":"nein"},null,null,{"$f":"IF(OR(O42='Hilfstab Auswahl SOPÄ'!$C$11,O42='Hilfstab Auswahl SOPÄ'!$C$12)*AND(P42>1),\"* genehmigungspflichtige LK\",0)","v":0},null,"",0,{"$f":"VLOOKUP($A42,'Hilfstab Auswahl SOPÄ'!$G$6:$H$9,2,FALSE)","v":"leer"},{"$f":"IF(E42=0,\"\",IF(I42=0,\"Jahrgang fehlt\",IF(YEAR(I42)>'Hilfstab AE'!$B$16,0,IF(AND(YEAR(I42)<('Hilfstab AE'!$B$16+1),YEAR(I42)>('Hilfstab AE'!$D$16-1)),\"AE56-60\",\"AE61+\"))))","v":""},"leer ",{"$f":"IF(N42=\"ja\",IF(AND(M42>24.999%,M42<50.001%),'Hilfstab Auswahl SOPÄ'!$J$5/2,IF(M42>50%,'Hilfstab Auswahl SOPÄ'!$J$5,0)),0)","v":{"v":0,"d":"0.000%"}}]
["Auswählen","Auswählen",{"$nulls":5},"Auswählen",null,"Auswählen","Auswählen",{"$nulls":3},"Auswählen","Auswählen",{"$f":"VLOOKUP(O43&P43,CHOOSE({1,2},'Hilfstab Löhne'!$A$3:$A$187&'Hilfstab Löhne'!$B$3:$B$187,'Hilfstab Löhne'!$D$3:$D$187),2,0)","v":0},0,{"v":0,"d":"0.000%"},{"$f":"ROUND(IF(S43=0,0,IF(OR(S43='Hilfstab Auswahl SOPÄ'!$L$6,S43='Hilfstab Auswahl SOPÄ'!$L$8),IF(M43>1,'Hilfstab Auswahl SOPÄ'!$M$6,'Hilfstab Auswahl SOPÄ'!$M$6*M43),IF(OR(S43='Hilfstab Auswahl SOPÄ'!$L$7,S43='Hilfstab Auswahl SOPÄ'!$L$9),IF(M43>1,'Hilfstab Auswahl SOPÄ'!$M$7,'Hilfstab Auswahl SOPÄ'!$M$7*M43),IF(S43='Hilfstab Auswahl SOPÄ'!$L$10,IF(M43>1,'Hilfstab Auswahl SOPÄ'!$M$10,'Hilfstab Auswahl SOPÄ'!$M$10*M43),IF(M43>1,'Hilfstab Auswahl SOPÄ'!$M$11,'Hilfstab Auswahl SOPÄ'!$M$11*M43))))),5)+AE43","v":{"v":0,"d":"0.000%"}},{"$f":"IF(V43=\"ja\",\"ja\",IF(O43=0,0,IF(OR(O43='Hilfstab Auswahl SOPÄ'!$C$7,O43='Hilfstab Auswahl SOPÄ'!$C$6,O43='Hilfstab Auswahl SOPÄ'!$C$13),\"ja\",\"nein\")))","v":"nein"},null,null,{"$f":"IF(OR(O43='Hilfstab Auswahl SOPÄ'!$C$11,O43='Hilfstab Auswahl SOPÄ'!$C$12)*AND(P43>1),\"* genehmigungspflichtige LK\",0)","v":0},null,"",0,{"$f":"VLOOKUP($A43,'Hilfstab Auswahl SOPÄ'!$G$6:$H$9,2,FALSE)","v":"leer"},{"$f":"IF(E43=0,\"\",IF(I43=0,\"Jahrgang fehlt\",IF(YEAR(I43)>'Hilfstab AE'!$B$16,0,IF(AND(YEAR(I43)<('Hilfstab AE'!$B$16+1),YEAR(I43)>('Hilfstab AE'!$D$16-1)),\"AE56-60\",\"AE61+\"))))","v":""},"leer ",{"$f":"IF(N43=\"ja\",IF(AND(M43>24.999%,M43<50.001%),'Hilfstab Auswahl SOPÄ'!$J$5/2,IF(M43>50%,'Hilfstab Auswahl SOPÄ'!$J$5,0)),0)","v":{"v":0,"d":"0.000%"}}]
["Auswählen","Auswählen",{"$nulls":5},"Auswählen",null,"Auswählen","Auswählen",{"$nulls":3},"Auswählen","Auswählen",{"$f":"VLOOKUP(O44&P44,CHOOSE({1,2},'Hilfstab Löhne'!$A$3:$A$187&'Hilfstab Löhne'!$B$3:$B$187,'Hilfstab Löhne'!$D$3:$D$187),2,0)","v":0},0,{"v":0,"d":"0.000%"},{"$f":"ROUND(IF(S44=0,0,IF(OR(S44='Hilfstab Auswahl SOPÄ'!$L$6,S44='Hilfstab Auswahl SOPÄ'!$L$8),IF(M44>1,'Hilfstab Auswahl SOPÄ'!$M$6,'Hilfstab Auswahl SOPÄ'!$M$6*M44),IF(OR(S44='Hilfstab Auswahl SOPÄ'!$L$7,S44='Hilfstab Auswahl SOPÄ'!$L$9),IF(M44>1,'Hilfstab Auswahl SOPÄ'!$M$7,'Hilfstab Auswahl SOPÄ'!$M$7*M44),IF(S44='Hilfstab Auswahl SOPÄ'!$L$10,IF(M44>1,'Hilfstab Auswahl SOPÄ'!$M$10,'Hilfstab Auswahl SOPÄ'!$M$10*M44),IF(M44>1,'Hilfstab Auswahl SOPÄ'!$M$11,'Hilfstab Auswahl SOPÄ'!$M$11*M44))))),5)+AE44","v":{"v":0,"d":"0.000%"}},{"$f":"IF(V44=\"ja\",\"ja\",IF(O44=0,0,IF(OR(O44='Hilfstab Auswahl SOPÄ'!$C$7,O44='Hilfstab Auswahl SOPÄ'!$C$6,O44='Hilfstab Auswahl SOPÄ'!$C$13),\"ja\",\"nein\")))","v":"nein"},null,null,{"$f":"IF(OR(O44='Hilfstab Auswahl SOPÄ'!$C$11,O44='Hilfstab Auswahl SOPÄ'!$C$12)*AND(P44>1),\"* genehmigungspflichtige LK\",0)","v":0},null,"",0,{"$f":"VLOOKUP($A44,'Hilfstab Auswahl SOPÄ'!$G$6:$H$9,2,FALSE)","v":"leer"},{"$f":"IF(E44=0,\"\",IF(I44=0,\"Jahrgang fehlt\",IF(YEAR(I44)>'Hilfstab AE'!$B$16,0,IF(AND(YEAR(I44)<('Hilfstab AE'!$B$16+1),YEAR(I44)>('Hilfstab AE'!$D$16-1)),\"AE56-60\",\"AE61+\"))))","v":""},"leer ",{"$f":"IF(N44=\"ja\",IF(AND(M44>24.999%,M44<50.001%),'Hilfstab Auswahl SOPÄ'!$J$5/2,IF(M44>50%,'Hilfstab Auswahl SOPÄ'!$J$5,0)),0)","v":{"v":0,"d":"0.000%"}}]
["Auswählen","Auswählen",{"$nulls":5},"Auswählen",null,"Auswählen","Auswählen",{"$nulls":3},"Auswählen","Auswählen",{"$f":"VLOOKUP(O45&P45,CHOOSE({1,2},'Hilfstab Löhne'!$A$3:$A$187&'Hilfstab Löhne'!$B$3:$B$187,'Hilfstab Löhne'!$D$3:$D$187),2,0)","v":0},0,{"v":0,"d":"0.000%"},{"$f":"ROUND(IF(S45=0,0,IF(OR(S45='Hilfstab Auswahl SOPÄ'!$L$6,S45='Hilfstab Auswahl SOPÄ'!$L$8),IF(M45>1,'Hilfstab Auswahl SOPÄ'!$M$6,'Hilfstab Auswahl SOPÄ'!$M$6*M45),IF(OR(S45='Hilfstab Auswahl SOPÄ'!$L$7,S45='Hilfstab Auswahl SOPÄ'!$L$9),IF(M45>1,'Hilfstab Auswahl SOPÄ'!$M$7,'Hilfstab Auswahl SOPÄ'!$M$7*M45),IF(S45='Hilfstab Auswahl SOPÄ'!$L$10,IF(M45>1,'Hilfstab Auswahl SOPÄ'!$M$10,'Hilfstab Auswahl SOPÄ'!$M$10*M45),IF(M45>1,'Hilfstab Auswahl SOPÄ'!$M$11,'Hilfstab Auswahl SOPÄ'!$M$11*M45))))),5)+AE45","v":{"v":0,"d":"0.000%"}},{"$f":"IF(V45=\"ja\",\"ja\",IF(O45=0,0,IF(OR(O45='Hilfstab Auswahl SOPÄ'!$C$7,O45='Hilfstab Auswahl SOPÄ'!$C$6,O45='Hilfstab Auswahl SOPÄ'!$C$13),\"ja\",\"nein\")))","v":"nein"},null,null,{"$f":"IF(OR(O45='Hilfstab Auswahl SOPÄ'!$C$11,O45='Hilfstab Auswahl SOPÄ'!$C$12)*AND(P45>1),\"* genehmigungspflichtige LK\",0)","v":0},null,"",0,{"$f":"VLOOKUP($A45,'Hilfstab Auswahl SOPÄ'!$G$6:$H$9,2,FALSE)","v":"leer"},{"$f":"IF(E45=0,\"\",IF(I45=0,\"Jahrgang fehlt\",IF(YEAR(I45)>'Hilfstab AE'!$B$16,0,IF(AND(YEAR(I45)<('Hilfstab AE'!$B$16+1),YEAR(I45)>('Hilfstab AE'!$D$16-1)),\"AE56-60\",\"AE61+\"))))","v":""},"leer ",{"$f":"IF(N45=\"ja\",IF(AND(M45>24.999%,M45<50.001%),'Hilfstab Auswahl SOPÄ'!$J$5/2,IF(M45>50%,'Hilfstab Auswahl SOPÄ'!$J$5,0)),0)","v":{"v":0,"d":"0.000%"}}]
["Auswählen","Auswählen",{"$nulls":5},"Auswählen",null,"Auswählen","Auswählen",{"$nulls":3},"Auswählen","Auswählen",{"$f":"VLOOKUP(O46&P46,CHOOSE({1,2},'Hilfstab Löhne'!$A$3:$A$187&'Hilfstab Löhne'!$B$3:$B$187,'Hilfstab Löhne'!$D$3:$D$187),2,0)","v":0},0,{"v":0,"d":"0.000%"},{"$f":"ROUND(IF(S46=0,0,IF(OR(S46='Hilfstab Auswahl SOPÄ'!$L$6,S46='Hilfstab Auswahl SOPÄ'!$L$8),IF(M46>1,'Hilfstab Auswahl SOPÄ'!$M$6,'Hilfstab Auswahl SOPÄ'!$M$6*M46),IF(OR(S46='Hilfstab Auswahl SOPÄ'!$L$7,S46='Hilfstab Auswahl SOPÄ'!$L$9),IF(M46>1,'Hilfstab Auswahl SOPÄ'!$M$7,'Hilfstab Auswahl SOPÄ'!$M$7*M46),IF(S46='Hilfstab Auswahl SOPÄ'!$L$10,IF(M46>1,'Hilfstab Auswahl SOPÄ'!$M$10,'Hilfstab Auswahl SOPÄ'!$M$10*M46),IF(M46>1,'Hilfstab Auswahl SOPÄ'!$M$11,'Hilfstab Auswahl SOPÄ'!$M$11*M46))))),5)+AE46","v":{"v":0,"d":"0.000%"}},{"$f":"IF(V46=\"ja\",\"ja\",IF(O46=0,0,IF(OR(O46='Hilfstab Auswahl SOPÄ'!$C$7,O46='Hilfstab Auswahl SOPÄ'!$C$6,O46='Hilfstab Auswahl SOPÄ'!$C$13),\"ja\",\"nein\")))","v":"nein"},null,null,{"$f":"IF(OR(O46='Hilfstab Auswahl SOPÄ'!$C$11,O46='Hilfstab Auswahl SOPÄ'!$C$12)*AND(P46>1),\"* genehmigungspflichtige LK\",0)","v":0},null,"",0,{"$f":"VLOOKUP($A46,'Hilfstab Auswahl SOPÄ'!$G$6:$H$9,2,FALSE)","v":"leer"},{"$f":"IF(E46=0,\"\",IF(I46=0,\"Jahrgang fehlt\",IF(YEAR(I46)>'Hilfstab AE'!$B$16,0,IF(AND(YEAR(I46)<('Hilfstab AE'!$B$16+1),YEAR(I46)>('Hilfstab AE'!$D$16-1)),\"AE56-60\",\"AE61+\"))))","v":""},"leer ",{"$f":"IF(N46=\"ja\",IF(AND(M46>24.999%,M46<50.001%),'Hilfstab Auswahl SOPÄ'!$J$5/2,IF(M46>50%,'Hilfstab Auswahl SOPÄ'!$J$5,0)),0)","v":{"v":0,"d":"0.000%"}}]
["Auswählen","Auswählen",{"$nulls":5},"Auswählen",null,"Auswählen","Auswählen",{"$nulls":3},"Auswählen","Auswählen",{"$f":"VLOOKUP(O47&P47,CHOOSE({1,2},'Hilfstab Löhne'!$A$3:$A$187&'Hilfstab Löhne'!$B$3:$B$187,'Hilfstab Löhne'!$D$3:$D$187),2,0)","v":0},0,{"v":0,"d":"0.000%"},{"$f":"ROUND(IF(S47=0,0,IF(OR(S47='Hilfstab Auswahl SOPÄ'!$L$6,S47='Hilfstab Auswahl SOPÄ'!$L$8),IF(M47>1,'Hilfstab Auswahl SOPÄ'!$M$6,'Hilfstab Auswahl SOPÄ'!$M$6*M47),IF(OR(S47='Hilfstab Auswahl SOPÄ'!$L$7,S47='Hilfstab Auswahl SOPÄ'!$L$9),IF(M47>1,'Hilfstab Auswahl SOPÄ'!$M$7,'Hilfstab Auswahl SOPÄ'!$M$7*M47),IF(S47='Hilfstab Auswahl SOPÄ'!$L$10,IF(M47>1,'Hilfstab Auswahl SOPÄ'!$M$10,'Hilfstab Auswahl SOPÄ'!$M$10*M47),IF(M47>1,'Hilfstab Auswahl SOPÄ'!$M$11,'Hilfstab Auswahl SOPÄ'!$M$11*M47))))),5)+AE47","v":{"v":0,"d":"0.000%"}},{"$f":"IF(V47=\"ja\",\"ja\",IF(O47=0,0,IF(OR(O47='Hilfstab Auswahl SOPÄ'!$C$7,O47='Hilfstab Auswahl SOPÄ'!$C$6,O47='Hilfstab Auswahl SOPÄ'!$C$13),\"ja\",\"nein\")))","v":"nein"},null,null,{"$f":"IF(OR(O47='Hilfstab Auswahl SOPÄ'!$C$11,O47='Hilfstab Auswahl SOPÄ'!$C$12)*AND(P47>1),\"* genehmigungspflichtige LK\",0)","v":0},null,"",0,{"$f":"VLOOKUP($A47,'Hilfstab Auswahl SOPÄ'!$G$6:$H$9,2,FALSE)","v":"leer"},{"$f":"IF(E47=0,\"\",IF(I47=0,\"Jahrgang fehlt\",IF(YEAR(I47)>'Hilfstab AE'!$B$16,0,IF(AND(YEAR(I47)<('Hilfstab AE'!$B$16+1),YEAR(I47)>('Hilfstab AE'!$D$16-1)),\"AE56-60\",\"AE61+\"))))","v":""},"leer ",{"$f":"IF(N47=\"ja\",IF(AND(M47>24.999%,M47<50.001%),'Hilfstab Auswahl SOPÄ'!$J$5/2,IF(M47>50%,'Hilfstab Auswahl SOPÄ'!$J$5,0)),0)","v":{"v":0,"d":"0.000%"}}]
["Auswählen","Auswählen",{"$nulls":5},"Auswählen",null,"Auswählen","Auswählen",{"$nulls":3},"Auswählen","Auswählen",{"$f":"VLOOKUP(O48&P48,CHOOSE({1,2},'Hilfstab Löhne'!$A$3:$A$187&'Hilfstab Löhne'!$B$3:$B$187,'Hilfstab Löhne'!$D$3:$D$187),2,0)","v":0},0,{"v":0,"d":"0.000%"},{"$f":"ROUND(IF(S48=0,0,IF(OR(S48='Hilfstab Auswahl SOPÄ'!$L$6,S48='Hilfstab Auswahl SOPÄ'!$L$8),IF(M48>1,'Hilfstab Auswahl SOPÄ'!$M$6,'Hilfstab Auswahl SOPÄ'!$M$6*M48),IF(OR(S48='Hilfstab Auswahl SOPÄ'!$L$7,S48='Hilfstab Auswahl SOPÄ'!$L$9),IF(M48>1,'Hilfstab Auswahl SOPÄ'!$M$7,'Hilfstab Auswahl SOPÄ'!$M$7*M48),IF(S48='Hilfstab Auswahl SOPÄ'!$L$10,IF(M48>1,'Hilfstab Auswahl SOPÄ'!$M$10,'Hilfstab Auswahl SOPÄ'!$M$10*M48),IF(M48>1,'Hilfstab Auswahl SOPÄ'!$M$11,'Hilfstab Auswahl SOPÄ'!$M$11*M48))))),5)+AE48","v":{"v":0,"d":"0.000%"}},{"$f":"IF(V48=\"ja\",\"ja\",IF(O48=0,0,IF(OR(O48='Hilfstab Auswahl SOPÄ'!$C$7,O48='Hilfstab Auswahl SOPÄ'!$C$6,O48='Hilfstab Auswahl SOPÄ'!$C$13),\"ja\",\"nein\")))","v":"nein"},null,null,{"$f":"IF(OR(O48='Hilfstab Auswahl SOPÄ'!$C$11,O48='Hilfstab Auswahl SOPÄ'!$C$12)*AND(P48>1),\"* genehmigungspflichtige LK\",0)","v":0},null,"",0,{"$f":"VLOOKUP($A48,'Hilfstab Auswahl SOPÄ'!$G$6:$H$9,2,FALSE)","v":"leer"},{"$f":"IF(E48=0,\"\",IF(I48=0,\"Jahrgang fehlt\",IF(YEAR(I48)>'Hilfstab AE'!$B$16,0,IF(AND(YEAR(I48)<('Hilfstab AE'!$B$16+1),YEAR(I48)>('Hilfstab AE'!$D$16-1)),\"AE56-60\",\"AE61+\"))))","v":""},"leer ",{"$f":"IF(N48=\"ja\",IF(AND(M48>24.999%,M48<50.001%),'Hilfstab Auswahl SOPÄ'!$J$5/2,IF(M48>50%,'Hilfstab Auswahl SOPÄ'!$J$5,0)),0)","v":{"v":0,"d":"0.000%"}}]
["Auswählen","Auswählen",{"$nulls":5},"Auswählen",null,"Auswählen","Auswählen",{"$nulls":3},"Auswählen","Auswählen",{"$f":"VLOOKUP(O49&P49,CHOOSE({1,2},'Hilfstab Löhne'!$A$3:$A$187&'Hilfstab Löhne'!$B$3:$B$187,'Hilfstab Löhne'!$D$3:$D$187),2,0)","v":0},0,{"v":0,"d":"0.000%"},{"$f":"ROUND(IF(S49=0,0,IF(OR(S49='Hilfstab Auswahl SOPÄ'!$L$6,S49='Hilfstab Auswahl SOPÄ'!$L$8),IF(M49>1,'Hilfstab Auswahl SOPÄ'!$M$6,'Hilfstab Auswahl SOPÄ'!$M$6*M49),IF(OR(S49='Hilfstab Auswahl SOPÄ'!$L$7,S49='Hilfstab Auswahl SOPÄ'!$L$9),IF(M49>1,'Hilfstab Auswahl SOPÄ'!$M$7,'Hilfstab Auswahl SOPÄ'!$M$7*M49),IF(S49='Hilfstab Auswahl SOPÄ'!$L$10,IF(M49>1,'Hilfstab Auswahl SOPÄ'!$M$10,'Hilfstab Auswahl SOPÄ'!$M$10*M49),IF(M49>1,'Hilfstab Auswahl SOPÄ'!$M$11,'Hilfstab Auswahl SOPÄ'!$M$11*M49))))),5)+AE49","v":{"v":0,"d":"0.000%"}},{"$f":"IF(V49=\"ja\",\"ja\",IF(O49=0,0,IF(OR(O49='Hilfstab Auswahl SOPÄ'!$C$7,O49='Hilfstab Auswahl SOPÄ'!$C$6,O49='Hilfstab Auswahl SOPÄ'!$C$13),\"ja\",\"nein\")))","v":"nein"},null,null,{"$f":"IF(OR(O49='Hilfstab Auswahl SOPÄ'!$C$11,O49='Hilfstab Auswahl SOPÄ'!$C$12)*AND(P49>1),\"* genehmigungspflichtige LK\",0)","v":0},null,"",0,{"$f":"VLOOKUP($A49,'Hilfstab Auswahl SOPÄ'!$G$6:$H$9,2,FALSE)","v":"leer"},{"$f":"IF(E49=0,\"\",IF(I49=0,\"Jahrgang fehlt\",IF(YEAR(I49)>'Hilfstab AE'!$B$16,0,IF(AND(YEAR(I49)<('Hilfstab AE'!$B$16+1),YEAR(I49)>('Hilfstab AE'!$D$16-1)),\"AE56-60\",\"AE61+\"))))","v":""},"leer ",{"$f":"IF(N49=\"ja\",IF(AND(M49>24.999%,M49<50.001%),'Hilfstab Auswahl SOPÄ'!$J$5/2,IF(M49>50%,'Hilfstab Auswahl SOPÄ'!$J$5,0)),0)","v":{"v":0,"d":"0.000%"}}]
["Auswählen","Auswählen",{"$nulls":5},"Auswählen",null,"Auswählen","Auswählen",{"$nulls":3},"Auswählen","Auswählen",{"$f":"VLOOKUP(O50&P50,CHOOSE({1,2},'Hilfstab Löhne'!$A$3:$A$187&'Hilfstab Löhne'!$B$3:$B$187,'Hilfstab Löhne'!$D$3:$D$187),2,0)","v":0},0,{"v":0,"d":"0.000%"},{"$f":"ROUND(IF(S50=0,0,IF(OR(S50='Hilfstab Auswahl SOPÄ'!$L$6,S50='Hilfstab Auswahl SOPÄ'!$L$8),IF(M50>1,'Hilfstab Auswahl SOPÄ'!$M$6,'Hilfstab Auswahl SOPÄ'!$M$6*M50),IF(OR(S50='Hilfstab Auswahl SOPÄ'!$L$7,S50='Hilfstab Auswahl SOPÄ'!$L$9),IF(M50>1,'Hilfstab Auswahl SOPÄ'!$M$7,'Hilfstab Auswahl SOPÄ'!$M$7*M50),IF(S50='Hilfstab Auswahl SOPÄ'!$L$10,IF(M50>1,'Hilfstab Auswahl SOPÄ'!$M$10,'Hilfstab Auswahl SOPÄ'!$M$10*M50),IF(M50>1,'Hilfstab Auswahl SOPÄ'!$M$11,'Hilfstab Auswahl SOPÄ'!$M$11*M50))))),5)+AE50","v":{"v":0,"d":"0.000%"}},{"$f":"IF(V50=\"ja\",\"ja\",IF(O50=0,0,IF(OR(O50='Hilfstab Auswahl SOPÄ'!$C$7,O50='Hilfstab Auswahl SOPÄ'!$C$6,O50='Hilfstab Auswahl SOPÄ'!$C$13),\"ja\",\"nein\")))","v":"nein"},null,null,{"$f":"IF(OR(O50='Hilfstab Auswahl SOPÄ'!$C$11,O50='Hilfstab Auswahl SOPÄ'!$C$12)*AND(P50>1),\"* genehmigungspflichtige LK\",0)","v":0},null,"",0,{"$f":"VLOOKUP($A50,'Hilfstab Auswahl SOPÄ'!$G$6:$H$9,2,FALSE)","v":"leer"},{"$f":"IF(E50=0,\"\",IF(I50=0,\"Jahrgang fehlt\",IF(YEAR(I50)>'Hilfstab AE'!$B$16,0,IF(AND(YEAR(I50)<('Hilfstab AE'!$B$16+1),YEAR(I50)>('Hilfstab AE'!$D$16-1)),\"AE56-60\",\"AE61+\"))))","v":""},"leer ",{"$f":"IF(N50=\"ja\",IF(AND(M50>24.999%,M50<50.001%),'Hilfstab Auswahl SOPÄ'!$J$5/2,IF(M50>50%,'Hilfstab Auswahl SOPÄ'!$J$5,0)),0)","v":{"v":0,"d":"0.000%"}}]
["Auswählen","Auswählen",{"$nulls":5},"Auswählen",null,"Auswählen","Auswählen",{"$nulls":3},"Auswählen","Auswählen",{"$f":"VLOOKUP(O51&P51,CHOOSE({1,2},'Hilfstab Löhne'!$A$3:$A$187&'Hilfstab Löhne'!$B$3:$B$187,'Hilfstab Löhne'!$D$3:$D$187),2,0)","v":0},0,{"v":0,"d":"0.000%"},{"$f":"ROUND(IF(S51=0,0,IF(OR(S51='Hilfstab Auswahl SOPÄ'!$L$6,S51='Hilfstab Auswahl SOPÄ'!$L$8),IF(M51>1,'Hilfstab Auswahl SOPÄ'!$M$6,'Hilfstab Auswahl SOPÄ'!$M$6*M51),IF(OR(S51='Hilfstab Auswahl SOPÄ'!$L$7,S51='Hilfstab Auswahl SOPÄ'!$L$9),IF(M51>1,'Hilfstab Auswahl SOPÄ'!$M$7,'Hilfstab Auswahl SOPÄ'!$M$7*M51),IF(S51='Hilfstab Auswahl SOPÄ'!$L$10,IF(M51>1,'Hilfstab Auswahl SOPÄ'!$M$10,'Hilfstab Auswahl SOPÄ'!$M$10*M51),IF(M51>1,'Hilfstab Auswahl SOPÄ'!$M$11,'Hilfstab Auswahl SOPÄ'!$M$11*M51))))),5)+AE51","v":{"v":0,"d":"0.000%"}},{"$f":"IF(V51=\"ja\",\"ja\",IF(O51=0,0,IF(OR(O51='Hilfstab Auswahl SOPÄ'!$C$7,O51='Hilfstab Auswahl SOPÄ'!$C$6,O51='Hilfstab Auswahl SOPÄ'!$C$13),\"ja\",\"nein\")))","v":"nein"},null,null,{"$f":"IF(OR(O51='Hilfstab Auswahl SOPÄ'!$C$11,O51='Hilfstab Auswahl SOPÄ'!$C$12)*AND(P51>1),\"* genehmigungspflichtige LK\",0)","v":0},null,"",0,{"$f":"VLOOKUP($A51,'Hilfstab Auswahl SOPÄ'!$G$6:$H$9,2,FALSE)","v":"leer"},{"$f":"IF(E51=0,\"\",IF(I51=0,\"Jahrgang fehlt\",IF(YEAR(I51)>'Hilfstab AE'!$B$16,0,IF(AND(YEAR(I51)<('Hilfstab AE'!$B$16+1),YEAR(I51)>('Hilfstab AE'!$D$16-1)),\"AE56-60\",\"AE61+\"))))","v":""},"leer ",{"$f":"IF(N51=\"ja\",IF(AND(M51>24.999%,M51<50.001%),'Hilfstab Auswahl SOPÄ'!$J$5/2,IF(M51>50%,'Hilfstab Auswahl SOPÄ'!$J$5,0)),0)","v":{"v":0,"d":"0.000%"}}]
["Auswählen","Auswählen",{"$nulls":5},"Auswählen",null,"Auswählen","Auswählen",{"$nulls":3},"Auswählen","Auswählen",{"$f":"VLOOKUP(O52&P52,CHOOSE({1,2},'Hilfstab Löhne'!$A$3:$A$187&'Hilfstab Löhne'!$B$3:$B$187,'Hilfstab Löhne'!$D$3:$D$187),2,0)","v":0},0,{"v":0,"d":"0.000%"},{"$f":"ROUND(IF(S52=0,0,IF(OR(S52='Hilfstab Auswahl SOPÄ'!$L$6,S52='Hilfstab Auswahl SOPÄ'!$L$8),IF(M52>1,'Hilfstab Auswahl SOPÄ'!$M$6,'Hilfstab Auswahl SOPÄ'!$M$6*M52),IF(OR(S52='Hilfstab Auswahl SOPÄ'!$L$7,S52='Hilfstab Auswahl SOPÄ'!$L$9),IF(M52>1,'Hilfstab Auswahl SOPÄ'!$M$7,'Hilfstab Auswahl SOPÄ'!$M$7*M52),IF(S52='Hilfstab Auswahl SOPÄ'!$L$10,IF(M52>1,'Hilfstab Auswahl SOPÄ'!$M$10,'Hilfstab Auswahl SOPÄ'!$M$10*M52),IF(M52>1,'Hilfstab Auswahl SOPÄ'!$M$11,'Hilfstab Auswahl SOPÄ'!$M$11*M52))))),5)+AE52","v":{"v":0,"d":"0.000%"}},{"$f":"IF(V52=\"ja\",\"ja\",IF(O52=0,0,IF(OR(O52='Hilfstab Auswahl SOPÄ'!$C$7,O52='Hilfstab Auswahl SOPÄ'!$C$6,O52='Hilfstab Auswahl SOPÄ'!$C$13),\"ja\",\"nein\")))","v":"nein"},null,null,{"$f":"IF(OR(O52='Hilfstab Auswahl SOPÄ'!$C$11,O52='Hilfstab Auswahl SOPÄ'!$C$12)*AND(P52>1),\"* genehmigungspflichtige LK\",0)","v":0},null,"",0,{"$f":"VLOOKUP($A52,'Hilfstab Auswahl SOPÄ'!$G$6:$H$9,2,FALSE)","v":"leer"},{"$f":"IF(E52=0,\"\",IF(I52=0,\"Jahrgang fehlt\",IF(YEAR(I52)>'Hilfstab AE'!$B$16,0,IF(AND(YEAR(I52)<('Hilfstab AE'!$B$16+1),YEAR(I52)>('Hilfstab AE'!$D$16-1)),\"AE56-60\",\"AE61+\"))))","v":""},"leer ",{"$f":"IF(N52=\"ja\",IF(AND(M52>24.999%,M52<50.001%),'Hilfstab Auswahl SOPÄ'!$J$5/2,IF(M52>50%,'Hilfstab Auswahl SOPÄ'!$J$5,0)),0)","v":{"v":0,"d":"0.000%"}}]
["Auswählen","Auswählen",{"$nulls":5},"Auswählen",null,"Auswählen","Auswählen",{"$nulls":3},"Auswählen","Auswählen",{"$f":"VLOOKUP(O53&P53,CHOOSE({1,2},'Hilfstab Löhne'!$A$3:$A$187&'Hilfstab Löhne'!$B$3:$B$187,'Hilfstab Löhne'!$D$3:$D$187),2,0)","v":0},0,{"v":0,"d":"0.000%"},{"$f":"ROUND(IF(S53=0,0,IF(OR(S53='Hilfstab Auswahl SOPÄ'!$L$6,S53='Hilfstab Auswahl SOPÄ'!$L$8),IF(M53>1,'Hilfstab Auswahl SOPÄ'!$M$6,'Hilfstab Auswahl SOPÄ'!$M$6*M53),IF(OR(S53='Hilfstab Auswahl SOPÄ'!$L$7,S53='Hilfstab Auswahl SOPÄ'!$L$9),IF(M53>1,'Hilfstab Auswahl SOPÄ'!$M$7,'Hilfstab Auswahl SOPÄ'!$M$7*M53),IF(S53='Hilfstab Auswahl SOPÄ'!$L$10,IF(M53>1,'Hilfstab Auswahl SOPÄ'!$M$10,'Hilfstab Auswahl SOPÄ'!$M$10*M53),IF(M53>1,'Hilfstab Auswahl SOPÄ'!$M$11,'Hilfstab Auswahl SOPÄ'!$M$11*M53))))),5)+AE53","v":{"v":0,"d":"0.000%"}},{"$f":"IF(V53=\"ja\",\"ja\",IF(O53=0,0,IF(OR(O53='Hilfstab Auswahl SOPÄ'!$C$7,O53='Hilfstab Auswahl SOPÄ'!$C$6,O53='Hilfstab Auswahl SOPÄ'!$C$13),\"ja\",\"nein\")))","v":"nein"},null,null,{"$f":"IF(OR(O53='Hilfstab Auswahl SOPÄ'!$C$11,O53='Hilfstab Auswahl SOPÄ'!$C$12)*AND(P53>1),\"* genehmigungspflichtige LK\",0)","v":0},null,"",0,{"$f":"VLOOKUP($A53,'Hilfstab Auswahl SOPÄ'!$G$6:$H$9,2,FALSE)","v":"leer"},{"$f":"IF(E53=0,\"\",IF(I53=0,\"Jahrgang fehlt\",IF(YEAR(I53)>'Hilfstab AE'!$B$16,0,IF(AND(YEAR(I53)<('Hilfstab AE'!$B$16+1),YEAR(I53)>('Hilfstab AE'!$D$16-1)),\"AE56-60\",\"AE61+\"))))","v":""},"leer ",{"$f":"IF(N53=\"ja\",IF(AND(M53>24.999%,M53<50.001%),'Hilfstab Auswahl SOPÄ'!$J$5/2,IF(M53>50%,'Hilfstab Auswahl SOPÄ'!$J$5,0)),0)","v":{"v":0,"d":"0.000%"}}]
["Auswählen","Auswählen",{"$nulls":5},"Auswählen",null,"Auswählen","Auswählen",{"$nulls":3},"Auswählen","Auswählen",{"$f":"VLOOKUP(O54&P54,CHOOSE({1,2},'Hilfstab Löhne'!$A$3:$A$187&'Hilfstab Löhne'!$B$3:$B$187,'Hilfstab Löhne'!$D$3:$D$187),2,0)","v":0},0,{"v":0,"d":"0.000%"},{"$f":"ROUND(IF(S54=0,0,IF(OR(S54='Hilfstab Auswahl SOPÄ'!$L$6,S54='Hilfstab Auswahl SOPÄ'!$L$8),IF(M54>1,'Hilfstab Auswahl SOPÄ'!$M$6,'Hilfstab Auswahl SOPÄ'!$M$6*M54),IF(OR(S54='Hilfstab Auswahl SOPÄ'!$L$7,S54='Hilfstab Auswahl SOPÄ'!$L$9),IF(M54>1,'Hilfstab Auswahl SOPÄ'!$M$7,'Hilfstab Auswahl SOPÄ'!$M$7*M54),IF(S54='Hilfstab Auswahl SOPÄ'!$L$10,IF(M54>1,'Hilfstab Auswahl SOPÄ'!$M$10,'Hilfstab Auswahl SOPÄ'!$M$10*M54),IF(M54>1,'Hilfstab Auswahl SOPÄ'!$M$11,'Hilfstab Auswahl SOPÄ'!$M$11*M54))))),5)+AE54","v":{"v":0,"d":"0.000%"}},{"$f":"IF(V54=\"ja\",\"ja\",IF(O54=0,0,IF(OR(O54='Hilfstab Auswahl SOPÄ'!$C$7,O54='Hilfstab Auswahl SOPÄ'!$C$6,O54='Hilfstab Auswahl SOPÄ'!$C$13),\"ja\",\"nein\")))","v":"nein"},null,null,{"$f":"IF(OR(O54='Hilfstab Auswahl SOPÄ'!$C$11,O54='Hilfstab Auswahl SOPÄ'!$C$12)*AND(P54>1),\"* genehmigungspflichtige LK\",0)","v":0},null,"",0,{"$f":"VLOOKUP($A54,'Hilfstab Auswahl SOPÄ'!$G$6:$H$9,2,FALSE)","v":"leer"},{"$f":"IF(E54=0,\"\",IF(I54=0,\"Jahrgang fehlt\",IF(YEAR(I54)>'Hilfstab AE'!$B$16,0,IF(AND(YEAR(I54)<('Hilfstab AE'!$B$16+1),YEAR(I54)>('Hilfstab AE'!$D$16-1)),\"AE56-60\",\"AE61+\"))))","v":""},"leer ",{"$f":"IF(N54=\"ja\",IF(AND(M54>24.999%,M54<50.001%),'Hilfstab Auswahl SOPÄ'!$J$5/2,IF(M54>50%,'Hilfstab Auswahl SOPÄ'!$J$5,0)),0)","v":{"v":0,"d":"0.000%"}}]
["Auswählen","Auswählen",{"$nulls":5},"Auswählen",null,"Auswählen","Auswählen",{"$nulls":3},"Auswählen","Auswählen",{"$f":"VLOOKUP(O55&P55,CHOOSE({1,2},'Hilfstab Löhne'!$A$3:$A$187&'Hilfstab Löhne'!$B$3:$B$187,'Hilfstab Löhne'!$D$3:$D$187),2,0)","v":0},0,{"v":0,"d":"0.000%"},{"$f":"ROUND(IF(S55=0,0,IF(OR(S55='Hilfstab Auswahl SOPÄ'!$L$6,S55='Hilfstab Auswahl SOPÄ'!$L$8),IF(M55>1,'Hilfstab Auswahl SOPÄ'!$M$6,'Hilfstab Auswahl SOPÄ'!$M$6*M55),IF(OR(S55='Hilfstab Auswahl SOPÄ'!$L$7,S55='Hilfstab Auswahl SOPÄ'!$L$9),IF(M55>1,'Hilfstab Auswahl SOPÄ'!$M$7,'Hilfstab Auswahl SOPÄ'!$M$7*M55),IF(S55='Hilfstab Auswahl SOPÄ'!$L$10,IF(M55>1,'Hilfstab Auswahl SOPÄ'!$M$10,'Hilfstab Auswahl SOPÄ'!$M$10*M55),IF(M55>1,'Hilfstab Auswahl SOPÄ'!$M$11,'Hilfstab Auswahl SOPÄ'!$M$11*M55))))),5)+AE55","v":{"v":0,"d":"0.000%"}},{"$f":"IF(V55=\"ja\",\"ja\",IF(O55=0,0,IF(OR(O55='Hilfstab Auswahl SOPÄ'!$C$7,O55='Hilfstab Auswahl SOPÄ'!$C$6,O55='Hilfstab Auswahl SOPÄ'!$C$13),\"ja\",\"nein\")))","v":"nein"},null,null,{"$f":"IF(OR(O55='Hilfstab Auswahl SOPÄ'!$C$11,O55='Hilfstab Auswahl SOPÄ'!$C$12)*AND(P55>1),\"* genehmigungspflichtige LK\",0)","v":0},null,"",0,{"$f":"VLOOKUP($A55,'Hilfstab Auswahl SOPÄ'!$G$6:$H$9,2,FALSE)","v":"leer"},{"$f":"IF(E55=0,\"\",IF(I55=0,\"Jahrgang fehlt\",IF(YEAR(I55)>'Hilfstab AE'!$B$16,0,IF(AND(YEAR(I55)<('Hilfstab AE'!$B$16+1),YEAR(I55)>('Hilfstab AE'!$D$16-1)),\"AE56-60\",\"AE61+\"))))","v":""},"leer ",{"$f":"IF(N55=\"ja\",IF(AND(M55>24.999%,M55<50.001%),'Hilfstab Auswahl SOPÄ'!$J$5/2,IF(M55>50%,'Hilfstab Auswahl SOPÄ'!$J$5,0)),0)","v":{"v":0,"d":"0.000%"}}]
["Auswählen","Auswählen",{"$nulls":5},"Auswählen",null,"Auswählen","Auswählen",{"$nulls":3},"Auswählen","Auswählen",{"$f":"VLOOKUP(O56&P56,CHOOSE({1,2},'Hilfstab Löhne'!$A$3:$A$187&'Hilfstab Löhne'!$B$3:$B$187,'Hilfstab Löhne'!$D$3:$D$187),2,0)","v":0},0,{"v":0,"d":"0.000%"},{"$f":"ROUND(IF(S56=0,0,IF(OR(S56='Hilfstab Auswahl SOPÄ'!$L$6,S56='Hilfstab Auswahl SOPÄ'!$L$8),IF(M56>1,'Hilfstab Auswahl SOPÄ'!$M$6,'Hilfstab Auswahl SOPÄ'!$M$6*M56),IF(OR(S56='Hilfstab Auswahl SOPÄ'!$L$7,S56='Hilfstab Auswahl SOPÄ'!$L$9),IF(M56>1,'Hilfstab Auswahl SOPÄ'!$M$7,'Hilfstab Auswahl SOPÄ'!$M$7*M56),IF(S56='Hilfstab Auswahl SOPÄ'!$L$10,IF(M56>1,'Hilfstab Auswahl SOPÄ'!$M$10,'Hilfstab Auswahl SOPÄ'!$M$10*M56),IF(M56>1,'Hilfstab Auswahl SOPÄ'!$M$11,'Hilfstab Auswahl SOPÄ'!$M$11*M56))))),5)+AE56","v":{"v":0,"d":"0.000%"}},{"$f":"IF(V56=\"ja\",\"ja\",IF(O56=0,0,IF(OR(O56='Hilfstab Auswahl SOPÄ'!$C$7,O56='Hilfstab Auswahl SOPÄ'!$C$6,O56='Hilfstab Auswahl SOPÄ'!$C$13),\"ja\",\"nein\")))","v":"nein"},null,null,{"$f":"IF(OR(O56='Hilfstab Auswahl SOPÄ'!$C$11,O56='Hilfstab Auswahl SOPÄ'!$C$12)*AND(P56>1),\"* genehmigungspflichtige LK\",0)","v":0},null,"",0,{"$f":"VLOOKUP($A56,'Hilfstab Auswahl SOPÄ'!$G$6:$H$9,2,FALSE)","v":"leer"},{"$f":"IF(E56=0,\"\",IF(I56=0,\"Jahrgang fehlt\",IF(YEAR(I56)>'Hilfstab AE'!$B$16,0,IF(AND(YEAR(I56)<('Hilfstab AE'!$B$16+1),YEAR(I56)>('Hilfstab AE'!$D$16-1)),\"AE56-60\",\"AE61+\"))))","v":""},"leer ",{"$f":"IF(N56=\"ja\",IF(AND(M56>24.999%,M56<50.001%),'Hilfstab Auswahl SOPÄ'!$J$5/2,IF(M56>50%,'Hilfstab Auswahl SOPÄ'!$J$5,0)),0)","v":{"v":0,"d":"0.000%"}}]
["Auswählen","Auswählen",{"$nulls":5},"Auswählen",null,"Auswählen","Auswählen",{"$nulls":3},"Auswählen","Auswählen",{"$f":"VLOOKUP(O57&P57,CHOOSE({1,2},'Hilfstab Löhne'!$A$3:$A$187&'Hilfstab Löhne'!$B$3:$B$187,'Hilfstab Löhne'!$D$3:$D$187),2,0)","v":0},0,{"v":0,"d":"0.000%"},{"$f":"ROUND(IF(S57=0,0,IF(OR(S57='Hilfstab Auswahl SOPÄ'!$L$6,S57='Hilfstab Auswahl SOPÄ'!$L$8),IF(M57>1,'Hilfstab Auswahl SOPÄ'!$M$6,'Hilfstab Auswahl SOPÄ'!$M$6*M57),IF(OR(S57='Hilfstab Auswahl SOPÄ'!$L$7,S57='Hilfstab Auswahl SOPÄ'!$L$9),IF(M57>1,'Hilfstab Auswahl SOPÄ'!$M$7,'Hilfstab Auswahl SOPÄ'!$M$7*M57),IF(S57='Hilfstab Auswahl SOPÄ'!$L$10,IF(M57>1,'Hilfstab Auswahl SOPÄ'!$M$10,'Hilfstab Auswahl SOPÄ'!$M$10*M57),IF(M57>1,'Hilfstab Auswahl SOPÄ'!$M$11,'Hilfstab Auswahl SOPÄ'!$M$11*M57))))),5)+AE57","v":{"v":0,"d":"0.000%"}},{"$f":"IF(V57=\"ja\",\"ja\",IF(O57=0,0,IF(OR(O57='Hilfstab Auswahl SOPÄ'!$C$7,O57='Hilfstab Auswahl SOPÄ'!$C$6,O57='Hilfstab Auswahl SOPÄ'!$C$13),\"ja\",\"nein\")))","v":"nein"},null,null,{"$f":"IF(OR(O57='Hilfstab Auswahl SOPÄ'!$C$11,O57='Hilfstab Auswahl SOPÄ'!$C$12)*AND(P57>1),\"* genehmigungspflichtige LK\",0)","v":0},null,"",0,{"$f":"VLOOKUP($A57,'Hilfstab Auswahl SOPÄ'!$G$6:$H$9,2,FALSE)","v":"leer"},{"$f":"IF(E57=0,\"\",IF(I57=0,\"Jahrgang fehlt\",IF(YEAR(I57)>'Hilfstab AE'!$B$16,0,IF(AND(YEAR(I57)<('Hilfstab AE'!$B$16+1),YEAR(I57)>('Hilfstab AE'!$D$16-1)),\"AE56-60\",\"AE61+\"))))","v":""},"leer ",{"$f":"IF(N57=\"ja\",IF(AND(M57>24.999%,M57<50.001%),'Hilfstab Auswahl SOPÄ'!$J$5/2,IF(M57>50%,'Hilfstab Auswahl SOPÄ'!$J$5,0)),0)","v":{"v":0,"d":"0.000%"}}]
["Auswählen","Auswählen",{"$nulls":5},"Auswählen",null,"Auswählen","Auswählen",{"$nulls":3},"Auswählen","Auswählen",{"$f":"VLOOKUP(O58&P58,CHOOSE({1,2},'Hilfstab Löhne'!$A$3:$A$187&'Hilfstab Löhne'!$B$3:$B$187,'Hilfstab Löhne'!$D$3:$D$187),2,0)","v":0},0,{"v":0,"d":"0.000%"},{"$f":"ROUND(IF(S58=0,0,IF(OR(S58='Hilfstab Auswahl SOPÄ'!$L$6,S58='Hilfstab Auswahl SOPÄ'!$L$8),IF(M58>1,'Hilfstab Auswahl SOPÄ'!$M$6,'Hilfstab Auswahl SOPÄ'!$M$6*M58),IF(OR(S58='Hilfstab Auswahl SOPÄ'!$L$7,S58='Hilfstab Auswahl SOPÄ'!$L$9),IF(M58>1,'Hilfstab Auswahl SOPÄ'!$M$7,'Hilfstab Auswahl SOPÄ'!$M$7*M58),IF(S58='Hilfstab Auswahl SOPÄ'!$L$10,IF(M58>1,'Hilfstab Auswahl SOPÄ'!$M$10,'Hilfstab Auswahl SOPÄ'!$M$10*M58),IF(M58>1,'Hilfstab Auswahl SOPÄ'!$M$11,'Hilfstab Auswahl SOPÄ'!$M$11*M58))))),5)+AE58","v":{"v":0,"d":"0.000%"}},{"$f":"IF(V58=\"ja\",\"ja\",IF(O58=0,0,IF(OR(O58='Hilfstab Auswahl SOPÄ'!$C$7,O58='Hilfstab Auswahl SOPÄ'!$C$6,O58='Hilfstab Auswahl SOPÄ'!$C$13),\"ja\",\"nein\")))","v":"nein"},null,null,{"$f":"IF(OR(O58='Hilfstab Auswahl SOPÄ'!$C$11,O58='Hilfstab Auswahl SOPÄ'!$C$12)*AND(P58>1),\"* genehmigungspflichtige LK\",0)","v":0},null,"",0,{"$f":"VLOOKUP($A58,'Hilfstab Auswahl SOPÄ'!$G$6:$H$9,2,FALSE)","v":"leer"},{"$f":"IF(E58=0,\"\",IF(I58=0,\"Jahrgang fehlt\",IF(YEAR(I58)>'Hilfstab AE'!$B$16,0,IF(AND(YEAR(I58)<('Hilfstab AE'!$B$16+1),YEAR(I58)>('Hilfstab AE'!$D$16-1)),\"AE56-60\",\"AE61+\"))))","v":""},"leer ",{"$f":"IF(N58=\"ja\",IF(AND(M58>24.999%,M58<50.001%),'Hilfstab Auswahl SOPÄ'!$J$5/2,IF(M58>50%,'Hilfstab Auswahl SOPÄ'!$J$5,0)),0)","v":{"v":0,"d":"0.000%"}}]
["Auswählen","Auswählen",{"$nulls":5},"Auswählen",null,"Auswählen","Auswählen",{"$nulls":3},"Auswählen","Auswählen",{"$f":"VLOOKUP(O59&P59,CHOOSE({1,2},'Hilfstab Löhne'!$A$3:$A$187&'Hilfstab Löhne'!$B$3:$B$187,'Hilfstab Löhne'!$D$3:$D$187),2,0)","v":0},0,{"v":0,"d":"0.000%"},{"$f":"ROUND(IF(S59=0,0,IF(OR(S59='Hilfstab Auswahl SOPÄ'!$L$6,S59='Hilfstab Auswahl SOPÄ'!$L$8),IF(M59>1,'Hilfstab Auswahl SOPÄ'!$M$6,'Hilfstab Auswahl SOPÄ'!$M$6*M59),IF(OR(S59='Hilfstab Auswahl SOPÄ'!$L$7,S59='Hilfstab Auswahl SOPÄ'!$L$9),IF(M59>1,'Hilfstab Auswahl SOPÄ'!$M$7,'Hilfstab Auswahl SOPÄ'!$M$7*M59),IF(S59='Hilfstab Auswahl SOPÄ'!$L$10,IF(M59>1,'Hilfstab Auswahl SOPÄ'!$M$10,'Hilfstab Auswahl SOPÄ'!$M$10*M59),IF(M59>1,'Hilfstab Auswahl SOPÄ'!$M$11,'Hilfstab Auswahl SOPÄ'!$M$11*M59))))),5)+AE59","v":{"v":0,"d":"0.000%"}},{"$f":"IF(V59=\"ja\",\"ja\",IF(O59=0,0,IF(OR(O59='Hilfstab Auswahl SOPÄ'!$C$7,O59='Hilfstab Auswahl SOPÄ'!$C$6,O59='Hilfstab Auswahl SOPÄ'!$C$13),\"ja\",\"nein\")))","v":"nein"},null,null,{"$f":"IF(OR(O59='Hilfstab Auswahl SOPÄ'!$C$11,O59='Hilfstab Auswahl SOPÄ'!$C$12)*AND(P59>1),\"* genehmigungspflichtige LK\",0)","v":0},null,"",0,{"$f":"VLOOKUP($A59,'Hilfstab Auswahl SOPÄ'!$G$6:$H$9,2,FALSE)","v":"leer"},{"$f":"IF(E59=0,\"\",IF(I59=0,\"Jahrgang fehlt\",IF(YEAR(I59)>'Hilfstab AE'!$B$16,0,IF(AND(YEAR(I59)<('Hilfstab AE'!$B$16+1),YEAR(I59)>('Hilfstab AE'!$D$16-1)),\"AE56-60\",\"AE61+\"))))","v":""},"leer ",{"$f":"IF(N59=\"ja\",IF(AND(M59>24.999%,M59<50.001%),'Hilfstab Auswahl SOPÄ'!$J$5/2,IF(M59>50%,'Hilfstab Auswahl SOPÄ'!$J$5,0)),0)","v":{"v":0,"d":"0.000%"}}]
["Auswählen","Auswählen",{"$nulls":5},"Auswählen",null,"Auswählen","Auswählen",{"$nulls":3},"Auswählen","Auswählen",{"$f":"VLOOKUP(O60&P60,CHOOSE({1,2},'Hilfstab Löhne'!$A$3:$A$187&'Hilfstab Löhne'!$B$3:$B$187,'Hilfstab Löhne'!$D$3:$D$187),2,0)","v":0},0,{"v":0,"d":"0.000%"},{"$f":"ROUND(IF(S60=0,0,IF(OR(S60='Hilfstab Auswahl SOPÄ'!$L$6,S60='Hilfstab Auswahl SOPÄ'!$L$8),IF(M60>1,'Hilfstab Auswahl SOPÄ'!$M$6,'Hilfstab Auswahl SOPÄ'!$M$6*M60),IF(OR(S60='Hilfstab Auswahl SOPÄ'!$L$7,S60='Hilfstab Auswahl SOPÄ'!$L$9),IF(M60>1,'Hilfstab Auswahl SOPÄ'!$M$7,'Hilfstab Auswahl SOPÄ'!$M$7*M60),IF(S60='Hilfstab Auswahl SOPÄ'!$L$10,IF(M60>1,'Hilfstab Auswahl SOPÄ'!$M$10,'Hilfstab Auswahl SOPÄ'!$M$10*M60),IF(M60>1,'Hilfstab Auswahl SOPÄ'!$M$11,'Hilfstab Auswahl SOPÄ'!$M$11*M60))))),5)+AE60","v":{"v":0,"d":"0.000%"}},{"$f":"IF(V60=\"ja\",\"ja\",IF(O60=0,0,IF(OR(O60='Hilfstab Auswahl SOPÄ'!$C$7,O60='Hilfstab Auswahl SOPÄ'!$C$6,O60='Hilfstab Auswahl SOPÄ'!$C$13),\"ja\",\"nein\")))","v":"nein"},null,null,{"$f":"IF(OR(O60='Hilfstab Auswahl SOPÄ'!$C$11,O60='Hilfstab Auswahl SOPÄ'!$C$12)*AND(P60>1),\"* genehmigungspflichtige LK\",0)","v":0},null,"",0,{"$f":"VLOOKUP($A60,'Hilfstab Auswahl SOPÄ'!$G$6:$H$9,2,FALSE)","v":"leer"},{"$f":"IF(E60=0,\"\",IF(I60=0,\"Jahrgang fehlt\",IF(YEAR(I60)>'Hilfstab AE'!$B$16,0,IF(AND(YEAR(I60)<('Hilfstab AE'!$B$16+1),YEAR(I60)>('Hilfstab AE'!$D$16-1)),\"AE56-60\",\"AE61+\"))))","v":""},"leer ",{"$f":"IF(N60=\"ja\",IF(AND(M60>24.999%,M60<50.001%),'Hilfstab Auswahl SOPÄ'!$J$5/2,IF(M60>50%,'Hilfstab Auswahl SOPÄ'!$J$5,0)),0)","v":{"v":0,"d":"0.000%"}}]
["Auswählen","Auswählen",{"$nulls":5},"Auswählen",null,"Auswählen","Auswählen",{"$nulls":3},"Auswählen","Auswählen",{"$f":"VLOOKUP(O61&P61,CHOOSE({1,2},'Hilfstab Löhne'!$A$3:$A$187&'Hilfstab Löhne'!$B$3:$B$187,'Hilfstab Löhne'!$D$3:$D$187),2,0)","v":0},0,{"v":0,"d":"0.000%"},{"$f":"ROUND(IF(S61=0,0,IF(OR(S61='Hilfstab Auswahl SOPÄ'!$L$6,S61='Hilfstab Auswahl SOPÄ'!$L$8),IF(M61>1,'Hilfstab Auswahl SOPÄ'!$M$6,'Hilfstab Auswahl SOPÄ'!$M$6*M61),IF(OR(S61='Hilfstab Auswahl SOPÄ'!$L$7,S61='Hilfstab Auswahl SOPÄ'!$L$9),IF(M61>1,'Hilfstab Auswahl SOPÄ'!$M$7,'Hilfstab Auswahl SOPÄ'!$M$7*M61),IF(S61='Hilfstab Auswahl SOPÄ'!$L$10,IF(M61>1,'Hilfstab Auswahl SOPÄ'!$M$10,'Hilfstab Auswahl SOPÄ'!$M$10*M61),IF(M61>1,'Hilfstab Auswahl SOPÄ'!$M$11,'Hilfstab Auswahl SOPÄ'!$M$11*M61))))),5)+AE61","v":{"v":0,"d":"0.000%"}},{"$f":"IF(V61=\"ja\",\"ja\",IF(O61=0,0,IF(OR(O61='Hilfstab Auswahl SOPÄ'!$C$7,O61='Hilfstab Auswahl SOPÄ'!$C$6,O61='Hilfstab Auswahl SOPÄ'!$C$13),\"ja\",\"nein\")))","v":"nein"},null,null,{"$f":"IF(OR(O61='Hilfstab Auswahl SOPÄ'!$C$11,O61='Hilfstab Auswahl SOPÄ'!$C$12)*AND(P61>1),\"* genehmigungspflichtige LK\",0)","v":0},null,"",0,{"$f":"VLOOKUP($A61,'Hilfstab Auswahl SOPÄ'!$G$6:$H$9,2,FALSE)","v":"leer"},{"$f":"IF(E61=0,\"\",IF(I61=0,\"Jahrgang fehlt\",IF(YEAR(I61)>'Hilfstab AE'!$B$16,0,IF(AND(YEAR(I61)<('Hilfstab AE'!$B$16+1),YEAR(I61)>('Hilfstab AE'!$D$16-1)),\"AE56-60\",\"AE61+\"))))","v":""},"leer ",{"$f":"IF(N61=\"ja\",IF(AND(M61>24.999%,M61<50.001%),'Hilfstab Auswahl SOPÄ'!$J$5/2,IF(M61>50%,'Hilfstab Auswahl SOPÄ'!$J$5,0)),0)","v":{"v":0,"d":"0.000%"}}]
["Auswählen","Auswählen",{"$nulls":5},"Auswählen",null,"Auswählen","Auswählen",{"$nulls":3},"Auswählen","Auswählen",{"$f":"VLOOKUP(O62&P62,CHOOSE({1,2},'Hilfstab Löhne'!$A$3:$A$187&'Hilfstab Löhne'!$B$3:$B$187,'Hilfstab Löhne'!$D$3:$D$187),2,0)","v":0},0,{"v":0,"d":"0.000%"},{"$f":"ROUND(IF(S62=0,0,IF(OR(S62='Hilfstab Auswahl SOPÄ'!$L$6,S62='Hilfstab Auswahl SOPÄ'!$L$8),IF(M62>1,'Hilfstab Auswahl SOPÄ'!$M$6,'Hilfstab Auswahl SOPÄ'!$M$6*M62),IF(OR(S62='Hilfstab Auswahl SOPÄ'!$L$7,S62='Hilfstab Auswahl SOPÄ'!$L$9),IF(M62>1,'Hilfstab Auswahl SOPÄ'!$M$7,'Hilfstab Auswahl SOPÄ'!$M$7*M62),IF(S62='Hilfstab Auswahl SOPÄ'!$L$10,IF(M62>1,'Hilfstab Auswahl SOPÄ'!$M$10,'Hilfstab Auswahl SOPÄ'!$M$10*M62),IF(M62>1,'Hilfstab Auswahl SOPÄ'!$M$11,'Hilfstab Auswahl SOPÄ'!$M$11*M62))))),5)+AE62","v":{"v":0,"d":"0.000%"}},{"$f":"IF(V62=\"ja\",\"ja\",IF(O62=0,0,IF(OR(O62='Hilfstab Auswahl SOPÄ'!$C$7,O62='Hilfstab Auswahl SOPÄ'!$C$6,O62='Hilfstab Auswahl SOPÄ'!$C$13),\"ja\",\"nein\")))","v":"nein"},null,null,{"$f":"IF(OR(O62='Hilfstab Auswahl SOPÄ'!$C$11,O62='Hilfstab Auswahl SOPÄ'!$C$12)*AND(P62>1),\"* genehmigungspflichtige LK\",0)","v":0},null,"",0,{"$f":"VLOOKUP($A62,'Hilfstab Auswahl SOPÄ'!$G$6:$H$9,2,FALSE)","v":"leer"},{"$f":"IF(E62=0,\"\",IF(I62=0,\"Jahrgang fehlt\",IF(YEAR(I62)>'Hilfstab AE'!$B$16,0,IF(AND(YEAR(I62)<('Hilfstab AE'!$B$16+1),YEAR(I62)>('Hilfstab AE'!$D$16-1)),\"AE56-60\",\"AE61+\"))))","v":""},"leer ",{"$f":"IF(N62=\"ja\",IF(AND(M62>24.999%,M62<50.001%),'Hilfstab Auswahl SOPÄ'!$J$5/2,IF(M62>50%,'Hilfstab Auswahl SOPÄ'!$J$5,0)),0)","v":{"v":0,"d":"0.000%"}}]
["Auswählen","Auswählen",{"$nulls":5},"Auswählen",null,"Auswählen","Auswählen",{"$nulls":3},"Auswählen","Auswählen",{"$f":"VLOOKUP(O63&P63,CHOOSE({1,2},'Hilfstab Löhne'!$A$3:$A$187&'Hilfstab Löhne'!$B$3:$B$187,'Hilfstab Löhne'!$D$3:$D$187),2,0)","v":0},0,{"v":0,"d":"0.000%"},{"$f":"ROUND(IF(S63=0,0,IF(OR(S63='Hilfstab Auswahl SOPÄ'!$L$6,S63='Hilfstab Auswahl SOPÄ'!$L$8),IF(M63>1,'Hilfstab Auswahl SOPÄ'!$M$6,'Hilfstab Auswahl SOPÄ'!$M$6*M63),IF(OR(S63='Hilfstab Auswahl SOPÄ'!$L$7,S63='Hilfstab Auswahl SOPÄ'!$L$9),IF(M63>1,'Hilfstab Auswahl SOPÄ'!$M$7,'Hilfstab Auswahl SOPÄ'!$M$7*M63),IF(S63='Hilfstab Auswahl SOPÄ'!$L$10,IF(M63>1,'Hilfstab Auswahl SOPÄ'!$M$10,'Hilfstab Auswahl SOPÄ'!$M$10*M63),IF(M63>1,'Hilfstab Auswahl SOPÄ'!$M$11,'Hilfstab Auswahl SOPÄ'!$M$11*M63))))),5)+AE63","v":{"v":0,"d":"0.000%"}},{"$f":"IF(V63=\"ja\",\"ja\",IF(O63=0,0,IF(OR(O63='Hilfstab Auswahl SOPÄ'!$C$7,O63='Hilfstab Auswahl SOPÄ'!$C$6,O63='Hilfstab Auswahl SOPÄ'!$C$13),\"ja\",\"nein\")))","v":"nein"},null,null,{"$f":"IF(OR(O63='Hilfstab Auswahl SOPÄ'!$C$11,O63='Hilfstab Auswahl SOPÄ'!$C$12)*AND(P63>1),\"* genehmigungspflichtige LK\",0)","v":0},null,"",0,{"$f":"VLOOKUP($A63,'Hilfstab Auswahl SOPÄ'!$G$6:$H$9,2,FALSE)","v":"leer"},{"$f":"IF(E63=0,\"\",IF(I63=0,\"Jahrgang fehlt\",IF(YEAR(I63)>'Hilfstab AE'!$B$16,0,IF(AND(YEAR(I63)<('Hilfstab AE'!$B$16+1),YEAR(I63)>('Hilfstab AE'!$D$16-1)),\"AE56-60\",\"AE61+\"))))","v":""},"leer ",{"$f":"IF(N63=\"ja\",IF(AND(M63>24.999%,M63<50.001%),'Hilfstab Auswahl SOPÄ'!$J$5/2,IF(M63>50%,'Hilfstab Auswahl SOPÄ'!$J$5,0)),0)","v":{"v":0,"d":"0.000%"}}]
["Auswählen","Auswählen",{"$nulls":5},"Auswählen",null,"Auswählen","Auswählen",{"$nulls":3},"Auswählen","Auswählen",{"$f":"VLOOKUP(O64&P64,CHOOSE({1,2},'Hilfstab Löhne'!$A$3:$A$187&'Hilfstab Löhne'!$B$3:$B$187,'Hilfstab Löhne'!$D$3:$D$187),2,0)","v":0},0,{"v":0,"d":"0.000%"},{"$f":"ROUND(IF(S64=0,0,IF(OR(S64='Hilfstab Auswahl SOPÄ'!$L$6,S64='Hilfstab Auswahl SOPÄ'!$L$8),IF(M64>1,'Hilfstab Auswahl SOPÄ'!$M$6,'Hilfstab Auswahl SOPÄ'!$M$6*M64),IF(OR(S64='Hilfstab Auswahl SOPÄ'!$L$7,S64='Hilfstab Auswahl SOPÄ'!$L$9),IF(M64>1,'Hilfstab Auswahl SOPÄ'!$M$7,'Hilfstab Auswahl SOPÄ'!$M$7*M64),IF(S64='Hilfstab Auswahl SOPÄ'!$L$10,IF(M64>1,'Hilfstab Auswahl SOPÄ'!$M$10,'Hilfstab Auswahl SOPÄ'!$M$10*M64),IF(M64>1,'Hilfstab Auswahl SOPÄ'!$M$11,'Hilfstab Auswahl SOPÄ'!$M$11*M64))))),5)+AE64","v":{"v":0,"d":"0.000%"}},{"$f":"IF(V64=\"ja\",\"ja\",IF(O64=0,0,IF(OR(O64='Hilfstab Auswahl SOPÄ'!$C$7,O64='Hilfstab Auswahl SOPÄ'!$C$6,O64='Hilfstab Auswahl SOPÄ'!$C$13),\"ja\",\"nein\")))","v":"nein"},null,null,{"$f":"IF(OR(O64='Hilfstab Auswahl SOPÄ'!$C$11,O64='Hilfstab Auswahl SOPÄ'!$C$12)*AND(P64>1),\"* genehmigungspflichtige LK\",0)","v":0},null,"",0,{"$f":"VLOOKUP($A64,'Hilfstab Auswahl SOPÄ'!$G$6:$H$9,2,FALSE)","v":"leer"},{"$f":"IF(E64=0,\"\",IF(I64=0,\"Jahrgang fehlt\",IF(YEAR(I64)>'Hilfstab AE'!$B$16,0,IF(AND(YEAR(I64)<('Hilfstab AE'!$B$16+1),YEAR(I64)>('Hilfstab AE'!$D$16-1)),\"AE56-60\",\"AE61+\"))))","v":""},"leer ",{"$f":"IF(N64=\"ja\",IF(AND(M64>24.999%,M64<50.001%),'Hilfstab Auswahl SOPÄ'!$J$5/2,IF(M64>50%,'Hilfstab Auswahl SOPÄ'!$J$5,0)),0)","v":{"v":0,"d":"0.000%"}}]
["Auswählen","Auswählen",{"$nulls":5},"Auswählen",null,"Auswählen","Auswählen",{"$nulls":3},"Auswählen","Auswählen",{"$f":"VLOOKUP(O65&P65,CHOOSE({1,2},'Hilfstab Löhne'!$A$3:$A$187&'Hilfstab Löhne'!$B$3:$B$187,'Hilfstab Löhne'!$D$3:$D$187),2,0)","v":0},0,{"v":0,"d":"0.000%"},{"$f":"ROUND(IF(S65=0,0,IF(OR(S65='Hilfstab Auswahl SOPÄ'!$L$6,S65='Hilfstab Auswahl SOPÄ'!$L$8),IF(M65>1,'Hilfstab Auswahl SOPÄ'!$M$6,'Hilfstab Auswahl SOPÄ'!$M$6*M65),IF(OR(S65='Hilfstab Auswahl SOPÄ'!$L$7,S65='Hilfstab Auswahl SOPÄ'!$L$9),IF(M65>1,'Hilfstab Auswahl SOPÄ'!$M$7,'Hilfstab Auswahl SOPÄ'!$M$7*M65),IF(S65='Hilfstab Auswahl SOPÄ'!$L$10,IF(M65>1,'Hilfstab Auswahl SOPÄ'!$M$10,'Hilfstab Auswahl SOPÄ'!$M$10*M65),IF(M65>1,'Hilfstab Auswahl SOPÄ'!$M$11,'Hilfstab Auswahl SOPÄ'!$M$11*M65))))),5)+AE65","v":{"v":0,"d":"0.000%"}},{"$f":"IF(V65=\"ja\",\"ja\",IF(O65=0,0,IF(OR(O65='Hilfstab Auswahl SOPÄ'!$C$7,O65='Hilfstab Auswahl SOPÄ'!$C$6,O65='Hilfstab Auswahl SOPÄ'!$C$13),\"ja\",\"nein\")))","v":"nein"},null,null,{"$f":"IF(OR(O65='Hilfstab Auswahl SOPÄ'!$C$11,O65='Hilfstab Auswahl SOPÄ'!$C$12)*AND(P65>1),\"* genehmigungspflichtige LK\",0)","v":0},null,"",0,{"$f":"VLOOKUP($A65,'Hilfstab Auswahl SOPÄ'!$G$6:$H$9,2,FALSE)","v":"leer"},{"$f":"IF(E65=0,\"\",IF(I65=0,\"Jahrgang fehlt\",IF(YEAR(I65)>'Hilfstab AE'!$B$16,0,IF(AND(YEAR(I65)<('Hilfstab AE'!$B$16+1),YEAR(I65)>('Hilfstab AE'!$D$16-1)),\"AE56-60\",\"AE61+\"))))","v":""},"leer ",{"$f":"IF(N65=\"ja\",IF(AND(M65>24.999%,M65<50.001%),'Hilfstab Auswahl SOPÄ'!$J$5/2,IF(M65>50%,'Hilfstab Auswahl SOPÄ'!$J$5,0)),0)","v":{"v":0,"d":"0.000%"}}]
["Auswählen","Auswählen",{"$nulls":5},"Auswählen",null,"Auswählen","Auswählen",{"$nulls":3},"Auswählen","Auswählen",{"$f":"VLOOKUP(O66&P66,CHOOSE({1,2},'Hilfstab Löhne'!$A$3:$A$187&'Hilfstab Löhne'!$B$3:$B$187,'Hilfstab Löhne'!$D$3:$D$187),2,0)","v":0},0,{"v":0,"d":"0.000%"},{"$f":"ROUND(IF(S66=0,0,IF(OR(S66='Hilfstab Auswahl SOPÄ'!$L$6,S66='Hilfstab Auswahl SOPÄ'!$L$8),IF(M66>1,'Hilfstab Auswahl SOPÄ'!$M$6,'Hilfstab Auswahl SOPÄ'!$M$6*M66),IF(OR(S66='Hilfstab Auswahl SOPÄ'!$L$7,S66='Hilfstab Auswahl SOPÄ'!$L$9),IF(M66>1,'Hilfstab Auswahl SOPÄ'!$M$7,'Hilfstab Auswahl SOPÄ'!$M$7*M66),IF(S66='Hilfstab Auswahl SOPÄ'!$L$10,IF(M66>1,'Hilfstab Auswahl SOPÄ'!$M$10,'Hilfstab Auswahl SOPÄ'!$M$10*M66),IF(M66>1,'Hilfstab Auswahl SOPÄ'!$M$11,'Hilfstab Auswahl SOPÄ'!$M$11*M66))))),5)+AE66","v":{"v":0,"d":"0.000%"}},{"$f":"IF(V66=\"ja\",\"ja\",IF(O66=0,0,IF(OR(O66='Hilfstab Auswahl SOPÄ'!$C$7,O66='Hilfstab Auswahl SOPÄ'!$C$6,O66='Hilfstab Auswahl SOPÄ'!$C$13),\"ja\",\"nein\")))","v":"nein"},null,null,{"$f":"IF(OR(O66='Hilfstab Auswahl SOPÄ'!$C$11,O66='Hilfstab Auswahl SOPÄ'!$C$12)*AND(P66>1),\"* genehmigungspflichtige LK\",0)","v":0},null,"",0,{"$f":"VLOOKUP($A66,'Hilfstab Auswahl SOPÄ'!$G$6:$H$9,2,FALSE)","v":"leer"},{"$f":"IF(E66=0,\"\",IF(I66=0,\"Jahrgang fehlt\",IF(YEAR(I66)>'Hilfstab AE'!$B$16,0,IF(AND(YEAR(I66)<('Hilfstab AE'!$B$16+1),YEAR(I66)>('Hilfstab AE'!$D$16-1)),\"AE56-60\",\"AE61+\"))))","v":""},"leer ",{"$f":"IF(N66=\"ja\",IF(AND(M66>24.999%,M66<50.001%),'Hilfstab Auswahl SOPÄ'!$J$5/2,IF(M66>50%,'Hilfstab Auswahl SOPÄ'!$J$5,0)),0)","v":{"v":0,"d":"0.000%"}}]
["Auswählen","Auswählen",{"$nulls":5},"Auswählen",null,"Auswählen","Auswählen",{"$nulls":3},"Auswählen","Auswählen",{"$f":"VLOOKUP(O67&P67,CHOOSE({1,2},'Hilfstab Löhne'!$A$3:$A$187&'Hilfstab Löhne'!$B$3:$B$187,'Hilfstab Löhne'!$D$3:$D$187),2,0)","v":0},0,{"v":0,"d":"0.000%"},{"$f":"ROUND(IF(S67=0,0,IF(OR(S67='Hilfstab Auswahl SOPÄ'!$L$6,S67='Hilfstab Auswahl SOPÄ'!$L$8),IF(M67>1,'Hilfstab Auswahl SOPÄ'!$M$6,'Hilfstab Auswahl SOPÄ'!$M$6*M67),IF(OR(S67='Hilfstab Auswahl SOPÄ'!$L$7,S67='Hilfstab Auswahl SOPÄ'!$L$9),IF(M67>1,'Hilfstab Auswahl SOPÄ'!$M$7,'Hilfstab Auswahl SOPÄ'!$M$7*M67),IF(S67='Hilfstab Auswahl SOPÄ'!$L$10,IF(M67>1,'Hilfstab Auswahl SOPÄ'!$M$10,'Hilfstab Auswahl SOPÄ'!$M$10*M67),IF(M67>1,'Hilfstab Auswahl SOPÄ'!$M$11,'Hilfstab Auswahl SOPÄ'!$M$11*M67))))),5)+AE67","v":{"v":0,"d":"0.000%"}},{"$f":"IF(V67=\"ja\",\"ja\",IF(O67=0,0,IF(OR(O67='Hilfstab Auswahl SOPÄ'!$C$7,O67='Hilfstab Auswahl SOPÄ'!$C$6,O67='Hilfstab Auswahl SOPÄ'!$C$13),\"ja\",\"nein\")))","v":"nein"},null,null,{"$f":"IF(OR(O67='Hilfstab Auswahl SOPÄ'!$C$11,O67='Hilfstab Auswahl SOPÄ'!$C$12)*AND(P67>1),\"* genehmigungspflichtige LK\",0)","v":0},null,"",0,{"$f":"VLOOKUP($A67,'Hilfstab Auswahl SOPÄ'!$G$6:$H$9,2,FALSE)","v":"leer"},{"$f":"IF(E67=0,\"\",IF(I67=0,\"Jahrgang fehlt\",IF(YEAR(I67)>'Hilfstab AE'!$B$16,0,IF(AND(YEAR(I67)<('Hilfstab AE'!$B$16+1),YEAR(I67)>('Hilfstab AE'!$D$16-1)),\"AE56-60\",\"AE61+\"))))","v":""},"leer ",{"$f":"IF(N67=\"ja\",IF(AND(M67>24.999%,M67<50.001%),'Hilfstab Auswahl SOPÄ'!$J$5/2,IF(M67>50%,'Hilfstab Auswahl SOPÄ'!$J$5,0)),0)","v":{"v":0,"d":"0.000%"}}]
["Auswählen","Auswählen",{"$nulls":5},"Auswählen",null,"Auswählen","Auswählen",{"$nulls":3},"Auswählen","Auswählen",{"$f":"VLOOKUP(O68&P68,CHOOSE({1,2},'Hilfstab Löhne'!$A$3:$A$187&'Hilfstab Löhne'!$B$3:$B$187,'Hilfstab Löhne'!$D$3:$D$187),2,0)","v":0},0,{"v":0,"d":"0.000%"},{"$f":"ROUND(IF(S68=0,0,IF(OR(S68='Hilfstab Auswahl SOPÄ'!$L$6,S68='Hilfstab Auswahl SOPÄ'!$L$8),IF(M68>1,'Hilfstab Auswahl SOPÄ'!$M$6,'Hilfstab Auswahl SOPÄ'!$M$6*M68),IF(OR(S68='Hilfstab Auswahl SOPÄ'!$L$7,S68='Hilfstab Auswahl SOPÄ'!$L$9),IF(M68>1,'Hilfstab Auswahl SOPÄ'!$M$7,'Hilfstab Auswahl SOPÄ'!$M$7*M68),IF(S68='Hilfstab Auswahl SOPÄ'!$L$10,IF(M68>1,'Hilfstab Auswahl SOPÄ'!$M$10,'Hilfstab Auswahl SOPÄ'!$M$10*M68),IF(M68>1,'Hilfstab Auswahl SOPÄ'!$M$11,'Hilfstab Auswahl SOPÄ'!$M$11*M68))))),5)+AE68","v":{"v":0,"d":"0.000%"}},{"$f":"IF(V68=\"ja\",\"ja\",IF(O68=0,0,IF(OR(O68='Hilfstab Auswahl SOPÄ'!$C$7,O68='Hilfstab Auswahl SOPÄ'!$C$6,O68='Hilfstab Auswahl SOPÄ'!$C$13),\"ja\",\"nein\")))","v":"nein"},null,null,{"$f":"IF(OR(O68='Hilfstab Auswahl SOPÄ'!$C$11,O68='Hilfstab Auswahl SOPÄ'!$C$12)*AND(P68>1),\"* genehmigungspflichtige LK\",0)","v":0},null,"",0,{"$f":"VLOOKUP($A68,'Hilfstab Auswahl SOPÄ'!$G$6:$H$9,2,FALSE)","v":"leer"},{"$f":"IF(E68=0,\"\",IF(I68=0,\"Jahrgang fehlt\",IF(YEAR(I68)>'Hilfstab AE'!$B$16,0,IF(AND(YEAR(I68)<('Hilfstab AE'!$B$16+1),YEAR(I68)>('Hilfstab AE'!$D$16-1)),\"AE56-60\",\"AE61+\"))))","v":""},"leer ",{"$f":"IF(N68=\"ja\",IF(AND(M68>24.999%,M68<50.001%),'Hilfstab Auswahl SOPÄ'!$J$5/2,IF(M68>50%,'Hilfstab Auswahl SOPÄ'!$J$5,0)),0)","v":{"v":0,"d":"0.000%"}}]
["Auswählen","Auswählen",{"$nulls":5},"Auswählen",null,"Auswählen","Auswählen",{"$nulls":3},"Auswählen","Auswählen",{"$f":"VLOOKUP(O69&P69,CHOOSE({1,2},'Hilfstab Löhne'!$A$3:$A$187&'Hilfstab Löhne'!$B$3:$B$187,'Hilfstab Löhne'!$D$3:$D$187),2,0)","v":0},0,{"v":0,"d":"0.000%"},{"$f":"ROUND(IF(S69=0,0,IF(OR(S69='Hilfstab Auswahl SOPÄ'!$L$6,S69='Hilfstab Auswahl SOPÄ'!$L$8),IF(M69>1,'Hilfstab Auswahl SOPÄ'!$M$6,'Hilfstab Auswahl SOPÄ'!$M$6*M69),IF(OR(S69='Hilfstab Auswahl SOPÄ'!$L$7,S69='Hilfstab Auswahl SOPÄ'!$L$9),IF(M69>1,'Hilfstab Auswahl SOPÄ'!$M$7,'Hilfstab Auswahl SOPÄ'!$M$7*M69),IF(S69='Hilfstab Auswahl SOPÄ'!$L$10,IF(M69>1,'Hilfstab Auswahl SOPÄ'!$M$10,'Hilfstab Auswahl SOPÄ'!$M$10*M69),IF(M69>1,'Hilfstab Auswahl SOPÄ'!$M$11,'Hilfstab Auswahl SOPÄ'!$M$11*M69))))),5)+AE69","v":{"v":0,"d":"0.000%"}},{"$f":"IF(V69=\"ja\",\"ja\",IF(O69=0,0,IF(OR(O69='Hilfstab Auswahl SOPÄ'!$C$7,O69='Hilfstab Auswahl SOPÄ'!$C$6,O69='Hilfstab Auswahl SOPÄ'!$C$13),\"ja\",\"nein\")))","v":"nein"},null,null,{"$f":"IF(OR(O69='Hilfstab Auswahl SOPÄ'!$C$11,O69='Hilfstab Auswahl SOPÄ'!$C$12)*AND(P69>1),\"* genehmigungspflichtige LK\",0)","v":0},null,"",0,{"$f":"VLOOKUP($A69,'Hilfstab Auswahl SOPÄ'!$G$6:$H$9,2,FALSE)","v":"leer"},{"$f":"IF(E69=0,\"\",IF(I69=0,\"Jahrgang fehlt\",IF(YEAR(I69)>'Hilfstab AE'!$B$16,0,IF(AND(YEAR(I69)<('Hilfstab AE'!$B$16+1),YEAR(I69)>('Hilfstab AE'!$D$16-1)),\"AE56-60\",\"AE61+\"))))","v":""},"leer ",{"$f":"IF(N69=\"ja\",IF(AND(M69>24.999%,M69<50.001%),'Hilfstab Auswahl SOPÄ'!$J$5/2,IF(M69>50%,'Hilfstab Auswahl SOPÄ'!$J$5,0)),0)","v":{"v":0,"d":"0.000%"}}]
["Auswählen","Auswählen",{"$nulls":5},"Auswählen",null,"Auswählen","Auswählen",{"$nulls":3},"Auswählen","Auswählen",{"$f":"VLOOKUP(O70&P70,CHOOSE({1,2},'Hilfstab Löhne'!$A$3:$A$187&'Hilfstab Löhne'!$B$3:$B$187,'Hilfstab Löhne'!$D$3:$D$187),2,0)","v":0},0,{"v":0,"d":"0.000%"},{"$f":"ROUND(IF(S70=0,0,IF(OR(S70='Hilfstab Auswahl SOPÄ'!$L$6,S70='Hilfstab Auswahl SOPÄ'!$L$8),IF(M70>1,'Hilfstab Auswahl SOPÄ'!$M$6,'Hilfstab Auswahl SOPÄ'!$M$6*M70),IF(OR(S70='Hilfstab Auswahl SOPÄ'!$L$7,S70='Hilfstab Auswahl SOPÄ'!$L$9),IF(M70>1,'Hilfstab Auswahl SOPÄ'!$M$7,'Hilfstab Auswahl SOPÄ'!$M$7*M70),IF(S70='Hilfstab Auswahl SOPÄ'!$L$10,IF(M70>1,'Hilfstab Auswahl SOPÄ'!$M$10,'Hilfstab Auswahl SOPÄ'!$M$10*M70),IF(M70>1,'Hilfstab Auswahl SOPÄ'!$M$11,'Hilfstab Auswahl SOPÄ'!$M$11*M70))))),5)+AE70","v":{"v":0,"d":"0.000%"}},{"$f":"IF(V70=\"ja\",\"ja\",IF(O70=0,0,IF(OR(O70='Hilfstab Auswahl SOPÄ'!$C$7,O70='Hilfstab Auswahl SOPÄ'!$C$6,O70='Hilfstab Auswahl SOPÄ'!$C$13),\"ja\",\"nein\")))","v":"nein"},null,null,{"$f":"IF(OR(O70='Hilfstab Auswahl SOPÄ'!$C$11,O70='Hilfstab Auswahl SOPÄ'!$C$12)*AND(P70>1),\"* genehmigungspflichtige LK\",0)","v":0},null,"",0,{"$f":"VLOOKUP($A70,'Hilfstab Auswahl SOPÄ'!$G$6:$H$9,2,FALSE)","v":"leer"},{"$f":"IF(E70=0,\"\",IF(I70=0,\"Jahrgang fehlt\",IF(YEAR(I70)>'Hilfstab AE'!$B$16,0,IF(AND(YEAR(I70)<('Hilfstab AE'!$B$16+1),YEAR(I70)>('Hilfstab AE'!$D$16-1)),\"AE56-60\",\"AE61+\"))))","v":""},"leer ",{"$f":"IF(N70=\"ja\",IF(AND(M70>24.999%,M70<50.001%),'Hilfstab Auswahl SOPÄ'!$J$5/2,IF(M70>50%,'Hilfstab Auswahl SOPÄ'!$J$5,0)),0)","v":{"v":0,"d":"0.000%"}}]
["Auswählen","Auswählen",{"$nulls":5},"Auswählen",null,"Auswählen","Auswählen",{"$nulls":3},"Auswählen","Auswählen",{"$f":"VLOOKUP(O71&P71,CHOOSE({1,2},'Hilfstab Löhne'!$A$3:$A$187&'Hilfstab Löhne'!$B$3:$B$187,'Hilfstab Löhne'!$D$3:$D$187),2,0)","v":0},0,{"v":0,"d":"0.000%"},{"$f":"ROUND(IF(S71=0,0,IF(OR(S71='Hilfstab Auswahl SOPÄ'!$L$6,S71='Hilfstab Auswahl SOPÄ'!$L$8),IF(M71>1,'Hilfstab Auswahl SOPÄ'!$M$6,'Hilfstab Auswahl SOPÄ'!$M$6*M71),IF(OR(S71='Hilfstab Auswahl SOPÄ'!$L$7,S71='Hilfstab Auswahl SOPÄ'!$L$9),IF(M71>1,'Hilfstab Auswahl SOPÄ'!$M$7,'Hilfstab Auswahl SOPÄ'!$M$7*M71),IF(S71='Hilfstab Auswahl SOPÄ'!$L$10,IF(M71>1,'Hilfstab Auswahl SOPÄ'!$M$10,'Hilfstab Auswahl SOPÄ'!$M$10*M71),IF(M71>1,'Hilfstab Auswahl SOPÄ'!$M$11,'Hilfstab Auswahl SOPÄ'!$M$11*M71))))),5)+AE71","v":{"v":0,"d":"0.000%"}},{"$f":"IF(V71=\"ja\",\"ja\",IF(O71=0,0,IF(OR(O71='Hilfstab Auswahl SOPÄ'!$C$7,O71='Hilfstab Auswahl SOPÄ'!$C$6,O71='Hilfstab Auswahl SOPÄ'!$C$13),\"ja\",\"nein\")))","v":"nein"},null,null,{"$f":"IF(OR(O71='Hilfstab Auswahl SOPÄ'!$C$11,O71='Hilfstab Auswahl SOPÄ'!$C$12)*AND(P71>1),\"* genehmigungspflichtige LK\",0)","v":0},null,"",0,{"$f":"VLOOKUP($A71,'Hilfstab Auswahl SOPÄ'!$G$6:$H$9,2,FALSE)","v":"leer"},{"$f":"IF(E71=0,\"\",IF(I71=0,\"Jahrgang fehlt\",IF(YEAR(I71)>'Hilfstab AE'!$B$16,0,IF(AND(YEAR(I71)<('Hilfstab AE'!$B$16+1),YEAR(I71)>('Hilfstab AE'!$D$16-1)),\"AE56-60\",\"AE61+\"))))","v":""},"leer ",{"$f":"IF(N71=\"ja\",IF(AND(M71>24.999%,M71<50.001%),'Hilfstab Auswahl SOPÄ'!$J$5/2,IF(M71>50%,'Hilfstab Auswahl SOPÄ'!$J$5,0)),0)","v":{"v":0,"d":"0.000%"}}]
["Auswählen","Auswählen",{"$nulls":5},"Auswählen",null,"Auswählen","Auswählen",{"$nulls":3},"Auswählen","Auswählen",{"$f":"VLOOKUP(O72&P72,CHOOSE({1,2},'Hilfstab Löhne'!$A$3:$A$187&'Hilfstab Löhne'!$B$3:$B$187,'Hilfstab Löhne'!$D$3:$D$187),2,0)","v":0},0,{"v":0,"d":"0.000%"},{"$f":"ROUND(IF(S72=0,0,IF(OR(S72='Hilfstab Auswahl SOPÄ'!$L$6,S72='Hilfstab Auswahl SOPÄ'!$L$8),IF(M72>1,'Hilfstab Auswahl SOPÄ'!$M$6,'Hilfstab Auswahl SOPÄ'!$M$6*M72),IF(OR(S72='Hilfstab Auswahl SOPÄ'!$L$7,S72='Hilfstab Auswahl SOPÄ'!$L$9),IF(M72>1,'Hilfstab Auswahl SOPÄ'!$M$7,'Hilfstab Auswahl SOPÄ'!$M$7*M72),IF(S72='Hilfstab Auswahl SOPÄ'!$L$10,IF(M72>1,'Hilfstab Auswahl SOPÄ'!$M$10,'Hilfstab Auswahl SOPÄ'!$M$10*M72),IF(M72>1,'Hilfstab Auswahl SOPÄ'!$M$11,'Hilfstab Auswahl SOPÄ'!$M$11*M72))))),5)+AE72","v":{"v":0,"d":"0.000%"}},{"$f":"IF(V72=\"ja\",\"ja\",IF(O72=0,0,IF(OR(O72='Hilfstab Auswahl SOPÄ'!$C$7,O72='Hilfstab Auswahl SOPÄ'!$C$6,O72='Hilfstab Auswahl SOPÄ'!$C$13),\"ja\",\"nein\")))","v":"nein"},null,null,{"$f":"IF(OR(O72='Hilfstab Auswahl SOPÄ'!$C$11,O72='Hilfstab Auswahl SOPÄ'!$C$12)*AND(P72>1),\"* genehmigungspflichtige LK\",0)","v":0},null,"",0,{"$f":"VLOOKUP($A72,'Hilfstab Auswahl SOPÄ'!$G$6:$H$9,2,FALSE)","v":"leer"},{"$f":"IF(E72=0,\"\",IF(I72=0,\"Jahrgang fehlt\",IF(YEAR(I72)>'Hilfstab AE'!$B$16,0,IF(AND(YEAR(I72)<('Hilfstab AE'!$B$16+1),YEAR(I72)>('Hilfstab AE'!$D$16-1)),\"AE56-60\",\"AE61+\"))))","v":""},"leer ",{"$f":"IF(N72=\"ja\",IF(AND(M72>24.999%,M72<50.001%),'Hilfstab Auswahl SOPÄ'!$J$5/2,IF(M72>50%,'Hilfstab Auswahl SOPÄ'!$J$5,0)),0)","v":{"v":0,"d":"0.000%"}}]
["Auswählen","Auswählen",{"$nulls":5},"Auswählen",null,"Auswählen","Auswählen",{"$nulls":3},"Auswählen","Auswählen",{"$f":"VLOOKUP(O73&P73,CHOOSE({1,2},'Hilfstab Löhne'!$A$3:$A$187&'Hilfstab Löhne'!$B$3:$B$187,'Hilfstab Löhne'!$D$3:$D$187),2,0)","v":0},0,{"v":0,"d":"0.000%"},{"$f":"ROUND(IF(S73=0,0,IF(OR(S73='Hilfstab Auswahl SOPÄ'!$L$6,S73='Hilfstab Auswahl SOPÄ'!$L$8),IF(M73>1,'Hilfstab Auswahl SOPÄ'!$M$6,'Hilfstab Auswahl SOPÄ'!$M$6*M73),IF(OR(S73='Hilfstab Auswahl SOPÄ'!$L$7,S73='Hilfstab Auswahl SOPÄ'!$L$9),IF(M73>1,'Hilfstab Auswahl SOPÄ'!$M$7,'Hilfstab Auswahl SOPÄ'!$M$7*M73),IF(S73='Hilfstab Auswahl SOPÄ'!$L$10,IF(M73>1,'Hilfstab Auswahl SOPÄ'!$M$10,'Hilfstab Auswahl SOPÄ'!$M$10*M73),IF(M73>1,'Hilfstab Auswahl SOPÄ'!$M$11,'Hilfstab Auswahl SOPÄ'!$M$11*M73))))),5)+AE73","v":{"v":0,"d":"0.000%"}},{"$f":"IF(V73=\"ja\",\"ja\",IF(O73=0,0,IF(OR(O73='Hilfstab Auswahl SOPÄ'!$C$7,O73='Hilfstab Auswahl SOPÄ'!$C$6,O73='Hilfstab Auswahl SOPÄ'!$C$13),\"ja\",\"nein\")))","v":"nein"},null,null,{"$f":"IF(OR(O73='Hilfstab Auswahl SOPÄ'!$C$11,O73='Hilfstab Auswahl SOPÄ'!$C$12)*AND(P73>1),\"* genehmigungspflichtige LK\",0)","v":0},null,"",0,{"$f":"VLOOKUP($A73,'Hilfstab Auswahl SOPÄ'!$G$6:$H$9,2,FALSE)","v":"leer"},{"$f":"IF(E73=0,\"\",IF(I73=0,\"Jahrgang fehlt\",IF(YEAR(I73)>'Hilfstab AE'!$B$16,0,IF(AND(YEAR(I73)<('Hilfstab AE'!$B$16+1),YEAR(I73)>('Hilfstab AE'!$D$16-1)),\"AE56-60\",\"AE61+\"))))","v":""},"leer ",{"$f":"IF(N73=\"ja\",IF(AND(M73>24.999%,M73<50.001%),'Hilfstab Auswahl SOPÄ'!$J$5/2,IF(M73>50%,'Hilfstab Auswahl SOPÄ'!$J$5,0)),0)","v":{"v":0,"d":"0.000%"}}]
["Auswählen","Auswählen",{"$nulls":5},"Auswählen",null,"Auswählen","Auswählen",{"$nulls":3},"Auswählen","Auswählen",{"$f":"VLOOKUP(O74&P74,CHOOSE({1,2},'Hilfstab Löhne'!$A$3:$A$187&'Hilfstab Löhne'!$B$3:$B$187,'Hilfstab Löhne'!$D$3:$D$187),2,0)","v":0},0,{"v":0,"d":"0.000%"},{"$f":"ROUND(IF(S74=0,0,IF(OR(S74='Hilfstab Auswahl SOPÄ'!$L$6,S74='Hilfstab Auswahl SOPÄ'!$L$8),IF(M74>1,'Hilfstab Auswahl SOPÄ'!$M$6,'Hilfstab Auswahl SOPÄ'!$M$6*M74),IF(OR(S74='Hilfstab Auswahl SOPÄ'!$L$7,S74='Hilfstab Auswahl SOPÄ'!$L$9),IF(M74>1,'Hilfstab Auswahl SOPÄ'!$M$7,'Hilfstab Auswahl SOPÄ'!$M$7*M74),IF(S74='Hilfstab Auswahl SOPÄ'!$L$10,IF(M74>1,'Hilfstab Auswahl SOPÄ'!$M$10,'Hilfstab Auswahl SOPÄ'!$M$10*M74),IF(M74>1,'Hilfstab Auswahl SOPÄ'!$M$11,'Hilfstab Auswahl SOPÄ'!$M$11*M74))))),5)+AE74","v":{"v":0,"d":"0.000%"}},{"$f":"IF(V74=\"ja\",\"ja\",IF(O74=0,0,IF(OR(O74='Hilfstab Auswahl SOPÄ'!$C$7,O74='Hilfstab Auswahl SOPÄ'!$C$6,O74='Hilfstab Auswahl SOPÄ'!$C$13),\"ja\",\"nein\")))","v":"nein"},null,null,{"$f":"IF(OR(O74='Hilfstab Auswahl SOPÄ'!$C$11,O74='Hilfstab Auswahl SOPÄ'!$C$12)*AND(P74>1),\"* genehmigungspflichtige LK\",0)","v":0},null,"",0,{"$f":"VLOOKUP($A74,'Hilfstab Auswahl SOPÄ'!$G$6:$H$9,2,FALSE)","v":"leer"},{"$f":"IF(E74=0,\"\",IF(I74=0,\"Jahrgang fehlt\",IF(YEAR(I74)>'Hilfstab AE'!$B$16,0,IF(AND(YEAR(I74)<('Hilfstab AE'!$B$16+1),YEAR(I74)>('Hilfstab AE'!$D$16-1)),\"AE56-60\",\"AE61+\"))))","v":""},"leer ",{"$f":"IF(N74=\"ja\",IF(AND(M74>24.999%,M74<50.001%),'Hilfstab Auswahl SOPÄ'!$J$5/2,IF(M74>50%,'Hilfstab Auswahl SOPÄ'!$J$5,0)),0)","v":{"v":0,"d":"0.000%"}}]
["Auswählen","Auswählen",{"$nulls":5},"Auswählen",null,"Auswählen","Auswählen",{"$nulls":3},"Auswählen","Auswählen",{"$f":"VLOOKUP(O75&P75,CHOOSE({1,2},'Hilfstab Löhne'!$A$3:$A$187&'Hilfstab Löhne'!$B$3:$B$187,'Hilfstab Löhne'!$D$3:$D$187),2,0)","v":0},0,{"v":0,"d":"0.000%"},{"$f":"ROUND(IF(S75=0,0,IF(OR(S75='Hilfstab Auswahl SOPÄ'!$L$6,S75='Hilfstab Auswahl SOPÄ'!$L$8),IF(M75>1,'Hilfstab Auswahl SOPÄ'!$M$6,'Hilfstab Auswahl SOPÄ'!$M$6*M75),IF(OR(S75='Hilfstab Auswahl SOPÄ'!$L$7,S75='Hilfstab Auswahl SOPÄ'!$L$9),IF(M75>1,'Hilfstab Auswahl SOPÄ'!$M$7,'Hilfstab Auswahl SOPÄ'!$M$7*M75),IF(S75='Hilfstab Auswahl SOPÄ'!$L$10,IF(M75>1,'Hilfstab Auswahl SOPÄ'!$M$10,'Hilfstab Auswahl SOPÄ'!$M$10*M75),IF(M75>1,'Hilfstab Auswahl SOPÄ'!$M$11,'Hilfstab Auswahl SOPÄ'!$M$11*M75))))),5)+AE75","v":{"v":0,"d":"0.000%"}},{"$f":"IF(V75=\"ja\",\"ja\",IF(O75=0,0,IF(OR(O75='Hilfstab Auswahl SOPÄ'!$C$7,O75='Hilfstab Auswahl SOPÄ'!$C$6,O75='Hilfstab Auswahl SOPÄ'!$C$13),\"ja\",\"nein\")))","v":"nein"},null,null,{"$f":"IF(OR(O75='Hilfstab Auswahl SOPÄ'!$C$11,O75='Hilfstab Auswahl SOPÄ'!$C$12)*AND(P75>1),\"* genehmigungspflichtige LK\",0)","v":0},null,"",0,{"$f":"VLOOKUP($A75,'Hilfstab Auswahl SOPÄ'!$G$6:$H$9,2,FALSE)","v":"leer"},{"$f":"IF(E75=0,\"\",IF(I75=0,\"Jahrgang fehlt\",IF(YEAR(I75)>'Hilfstab AE'!$B$16,0,IF(AND(YEAR(I75)<('Hilfstab AE'!$B$16+1),YEAR(I75)>('Hilfstab AE'!$D$16-1)),\"AE56-60\",\"AE61+\"))))","v":""},"leer ",{"$f":"IF(N75=\"ja\",IF(AND(M75>24.999%,M75<50.001%),'Hilfstab Auswahl SOPÄ'!$J$5/2,IF(M75>50%,'Hilfstab Auswahl SOPÄ'!$J$5,0)),0)","v":{"v":0,"d":"0.000%"}}]
["Auswählen","Auswählen",{"$nulls":5},"Auswählen",null,"Auswählen","Auswählen",{"$nulls":3},"Auswählen","Auswählen",{"$f":"VLOOKUP(O76&P76,CHOOSE({1,2},'Hilfstab Löhne'!$A$3:$A$187&'Hilfstab Löhne'!$B$3:$B$187,'Hilfstab Löhne'!$D$3:$D$187),2,0)","v":0},0,{"v":0,"d":"0.000%"},{"$f":"ROUND(IF(S76=0,0,IF(OR(S76='Hilfstab Auswahl SOPÄ'!$L$6,S76='Hilfstab Auswahl SOPÄ'!$L$8),IF(M76>1,'Hilfstab Auswahl SOPÄ'!$M$6,'Hilfstab Auswahl SOPÄ'!$M$6*M76),IF(OR(S76='Hilfstab Auswahl SOPÄ'!$L$7,S76='Hilfstab Auswahl SOPÄ'!$L$9),IF(M76>1,'Hilfstab Auswahl SOPÄ'!$M$7,'Hilfstab Auswahl SOPÄ'!$M$7*M76),IF(S76='Hilfstab Auswahl SOPÄ'!$L$10,IF(M76>1,'Hilfstab Auswahl SOPÄ'!$M$10,'Hilfstab Auswahl SOPÄ'!$M$10*M76),IF(M76>1,'Hilfstab Auswahl SOPÄ'!$M$11,'Hilfstab Auswahl SOPÄ'!$M$11*M76))))),5)+AE76","v":{"v":0,"d":"0.000%"}},{"$f":"IF(V76=\"ja\",\"ja\",IF(O76=0,0,IF(OR(O76='Hilfstab Auswahl SOPÄ'!$C$7,O76='Hilfstab Auswahl SOPÄ'!$C$6,O76='Hilfstab Auswahl SOPÄ'!$C$13),\"ja\",\"nein\")))","v":"nein"},null,null,{"$f":"IF(OR(O76='Hilfstab Auswahl SOPÄ'!$C$11,O76='Hilfstab Auswahl SOPÄ'!$C$12)*AND(P76>1),\"* genehmigungspflichtige LK\",0)","v":0},null,"",0,{"$f":"VLOOKUP($A76,'Hilfstab Auswahl SOPÄ'!$G$6:$H$9,2,FALSE)","v":"leer"},{"$f":"IF(E76=0,\"\",IF(I76=0,\"Jahrgang fehlt\",IF(YEAR(I76)>'Hilfstab AE'!$B$16,0,IF(AND(YEAR(I76)<('Hilfstab AE'!$B$16+1),YEAR(I76)>('Hilfstab AE'!$D$16-1)),\"AE56-60\",\"AE61+\"))))","v":""},"leer ",{"$f":"IF(N76=\"ja\",IF(AND(M76>24.999%,M76<50.001%),'Hilfstab Auswahl SOPÄ'!$J$5/2,IF(M76>50%,'Hilfstab Auswahl SOPÄ'!$J$5,0)),0)","v":{"v":0,"d":"0.000%"}}]
["Auswählen","Auswählen",{"$nulls":5},"Auswählen",null,"Auswählen","Auswählen",{"$nulls":3},"Auswählen","Auswählen",{"$f":"VLOOKUP(O77&P77,CHOOSE({1,2},'Hilfstab Löhne'!$A$3:$A$187&'Hilfstab Löhne'!$B$3:$B$187,'Hilfstab Löhne'!$D$3:$D$187),2,0)","v":0},0,{"v":0,"d":"0.000%"},{"$f":"ROUND(IF(S77=0,0,IF(OR(S77='Hilfstab Auswahl SOPÄ'!$L$6,S77='Hilfstab Auswahl SOPÄ'!$L$8),IF(M77>1,'Hilfstab Auswahl SOPÄ'!$M$6,'Hilfstab Auswahl SOPÄ'!$M$6*M77),IF(OR(S77='Hilfstab Auswahl SOPÄ'!$L$7,S77='Hilfstab Auswahl SOPÄ'!$L$9),IF(M77>1,'Hilfstab Auswahl SOPÄ'!$M$7,'Hilfstab Auswahl SOPÄ'!$M$7*M77),IF(S77='Hilfstab Auswahl SOPÄ'!$L$10,IF(M77>1,'Hilfstab Auswahl SOPÄ'!$M$10,'Hilfstab Auswahl SOPÄ'!$M$10*M77),IF(M77>1,'Hilfstab Auswahl SOPÄ'!$M$11,'Hilfstab Auswahl SOPÄ'!$M$11*M77))))),5)+AE77","v":{"v":0,"d":"0.000%"}},{"$f":"IF(V77=\"ja\",\"ja\",IF(O77=0,0,IF(OR(O77='Hilfstab Auswahl SOPÄ'!$C$7,O77='Hilfstab Auswahl SOPÄ'!$C$6,O77='Hilfstab Auswahl SOPÄ'!$C$13),\"ja\",\"nein\")))","v":"nein"},null,null,{"$f":"IF(OR(O77='Hilfstab Auswahl SOPÄ'!$C$11,O77='Hilfstab Auswahl SOPÄ'!$C$12)*AND(P77>1),\"* genehmigungspflichtige LK\",0)","v":0},null,"",0,{"$f":"VLOOKUP($A77,'Hilfstab Auswahl SOPÄ'!$G$6:$H$9,2,FALSE)","v":"leer"},{"$f":"IF(E77=0,\"\",IF(I77=0,\"Jahrgang fehlt\",IF(YEAR(I77)>'Hilfstab AE'!$B$16,0,IF(AND(YEAR(I77)<('Hilfstab AE'!$B$16+1),YEAR(I77)>('Hilfstab AE'!$D$16-1)),\"AE56-60\",\"AE61+\"))))","v":""},"leer ",{"$f":"IF(N77=\"ja\",IF(AND(M77>24.999%,M77<50.001%),'Hilfstab Auswahl SOPÄ'!$J$5/2,IF(M77>50%,'Hilfstab Auswahl SOPÄ'!$J$5,0)),0)","v":{"v":0,"d":"0.000%"}}]
["Auswählen","Auswählen",{"$nulls":5},"Auswählen",null,"Auswählen","Auswählen",{"$nulls":3},"Auswählen","Auswählen",{"$f":"VLOOKUP(O78&P78,CHOOSE({1,2},'Hilfstab Löhne'!$A$3:$A$187&'Hilfstab Löhne'!$B$3:$B$187,'Hilfstab Löhne'!$D$3:$D$187),2,0)","v":0},0,{"v":0,"d":"0.000%"},{"$f":"ROUND(IF(S78=0,0,IF(OR(S78='Hilfstab Auswahl SOPÄ'!$L$6,S78='Hilfstab Auswahl SOPÄ'!$L$8),IF(M78>1,'Hilfstab Auswahl SOPÄ'!$M$6,'Hilfstab Auswahl SOPÄ'!$M$6*M78),IF(OR(S78='Hilfstab Auswahl SOPÄ'!$L$7,S78='Hilfstab Auswahl SOPÄ'!$L$9),IF(M78>1,'Hilfstab Auswahl SOPÄ'!$M$7,'Hilfstab Auswahl SOPÄ'!$M$7*M78),IF(S78='Hilfstab Auswahl SOPÄ'!$L$10,IF(M78>1,'Hilfstab Auswahl SOPÄ'!$M$10,'Hilfstab Auswahl SOPÄ'!$M$10*M78),IF(M78>1,'Hilfstab Auswahl SOPÄ'!$M$11,'Hilfstab Auswahl SOPÄ'!$M$11*M78))))),5)+AE78","v":{"v":0,"d":"0.000%"}},{"$f":"IF(V78=\"ja\",\"ja\",IF(O78=0,0,IF(OR(O78='Hilfstab Auswahl SOPÄ'!$C$7,O78='Hilfstab Auswahl SOPÄ'!$C$6,O78='Hilfstab Auswahl SOPÄ'!$C$13),\"ja\",\"nein\")))","v":"nein"},null,null,{"$f":"IF(OR(O78='Hilfstab Auswahl SOPÄ'!$C$11,O78='Hilfstab Auswahl SOPÄ'!$C$12)*AND(P78>1),\"* genehmigungspflichtige LK\",0)","v":0},null,"",0,{"$f":"VLOOKUP($A78,'Hilfstab Auswahl SOPÄ'!$G$6:$H$9,2,FALSE)","v":"leer"},{"$f":"IF(E78=0,\"\",IF(I78=0,\"Jahrgang fehlt\",IF(YEAR(I78)>'Hilfstab AE'!$B$16,0,IF(AND(YEAR(I78)<('Hilfstab AE'!$B$16+1),YEAR(I78)>('Hilfstab AE'!$D$16-1)),\"AE56-60\",\"AE61+\"))))","v":""},"leer ",{"$f":"IF(N78=\"ja\",IF(AND(M78>24.999%,M78<50.001%),'Hilfstab Auswahl SOPÄ'!$J$5/2,IF(M78>50%,'Hilfstab Auswahl SOPÄ'!$J$5,0)),0)","v":{"v":0,"d":"0.000%"}}]
["Auswählen","Auswählen",{"$nulls":5},"Auswählen",null,"Auswählen","Auswählen",{"$nulls":3},"Auswählen","Auswählen",{"$f":"VLOOKUP(O79&P79,CHOOSE({1,2},'Hilfstab Löhne'!$A$3:$A$187&'Hilfstab Löhne'!$B$3:$B$187,'Hilfstab Löhne'!$D$3:$D$187),2,0)","v":0},0,{"v":0,"d":"0.000%"},{"$f":"ROUND(IF(S79=0,0,IF(OR(S79='Hilfstab Auswahl SOPÄ'!$L$6,S79='Hilfstab Auswahl SOPÄ'!$L$8),IF(M79>1,'Hilfstab Auswahl SOPÄ'!$M$6,'Hilfstab Auswahl SOPÄ'!$M$6*M79),IF(OR(S79='Hilfstab Auswahl SOPÄ'!$L$7,S79='Hilfstab Auswahl SOPÄ'!$L$9),IF(M79>1,'Hilfstab Auswahl SOPÄ'!$M$7,'Hilfstab Auswahl SOPÄ'!$M$7*M79),IF(S79='Hilfstab Auswahl SOPÄ'!$L$10,IF(M79>1,'Hilfstab Auswahl SOPÄ'!$M$10,'Hilfstab Auswahl SOPÄ'!$M$10*M79),IF(M79>1,'Hilfstab Auswahl SOPÄ'!$M$11,'Hilfstab Auswahl SOPÄ'!$M$11*M79))))),5)+AE79","v":{"v":0,"d":"0.000%"}},{"$f":"IF(V79=\"ja\",\"ja\",IF(O79=0,0,IF(OR(O79='Hilfstab Auswahl SOPÄ'!$C$7,O79='Hilfstab Auswahl SOPÄ'!$C$6,O79='Hilfstab Auswahl SOPÄ'!$C$13),\"ja\",\"nein\")))","v":"nein"},null,null,{"$f":"IF(OR(O79='Hilfstab Auswahl SOPÄ'!$C$11,O79='Hilfstab Auswahl SOPÄ'!$C$12)*AND(P79>1),\"* genehmigungspflichtige LK\",0)","v":0},null,"",0,{"$f":"VLOOKUP($A79,'Hilfstab Auswahl SOPÄ'!$G$6:$H$9,2,FALSE)","v":"leer"},{"$f":"IF(E79=0,\"\",IF(I79=0,\"Jahrgang fehlt\",IF(YEAR(I79)>'Hilfstab AE'!$B$16,0,IF(AND(YEAR(I79)<('Hilfstab AE'!$B$16+1),YEAR(I79)>('Hilfstab AE'!$D$16-1)),\"AE56-60\",\"AE61+\"))))","v":""},"leer ",{"$f":"IF(N79=\"ja\",IF(AND(M79>24.999%,M79<50.001%),'Hilfstab Auswahl SOPÄ'!$J$5/2,IF(M79>50%,'Hilfstab Auswahl SOPÄ'!$J$5,0)),0)","v":{"v":0,"d":"0.000%"}}]
["Auswählen","Auswählen",{"$nulls":5},"Auswählen",null,"Auswählen","Auswählen",{"$nulls":3},"Auswählen","Auswählen",{"$f":"VLOOKUP(O80&P80,CHOOSE({1,2},'Hilfstab Löhne'!$A$3:$A$187&'Hilfstab Löhne'!$B$3:$B$187,'Hilfstab Löhne'!$D$3:$D$187),2,0)","v":0},0,{"v":0,"d":"0.000%"},{"$f":"ROUND(IF(S80=0,0,IF(OR(S80='Hilfstab Auswahl SOPÄ'!$L$6,S80='Hilfstab Auswahl SOPÄ'!$L$8),IF(M80>1,'Hilfstab Auswahl SOPÄ'!$M$6,'Hilfstab Auswahl SOPÄ'!$M$6*M80),IF(OR(S80='Hilfstab Auswahl SOPÄ'!$L$7,S80='Hilfstab Auswahl SOPÄ'!$L$9),IF(M80>1,'Hilfstab Auswahl SOPÄ'!$M$7,'Hilfstab Auswahl SOPÄ'!$M$7*M80),IF(S80='Hilfstab Auswahl SOPÄ'!$L$10,IF(M80>1,'Hilfstab Auswahl SOPÄ'!$M$10,'Hilfstab Auswahl SOPÄ'!$M$10*M80),IF(M80>1,'Hilfstab Auswahl SOPÄ'!$M$11,'Hilfstab Auswahl SOPÄ'!$M$11*M80))))),5)+AE80","v":{"v":0,"d":"0.000%"}},{"$f":"IF(V80=\"ja\",\"ja\",IF(O80=0,0,IF(OR(O80='Hilfstab Auswahl SOPÄ'!$C$7,O80='Hilfstab Auswahl SOPÄ'!$C$6,O80='Hilfstab Auswahl SOPÄ'!$C$13),\"ja\",\"nein\")))","v":"nein"},null,null,{"$f":"IF(OR(O80='Hilfstab Auswahl SOPÄ'!$C$11,O80='Hilfstab Auswahl SOPÄ'!$C$12)*AND(P80>1),\"* genehmigungspflichtige LK\",0)","v":0},null,"",0,{"$f":"VLOOKUP($A80,'Hilfstab Auswahl SOPÄ'!$G$6:$H$9,2,FALSE)","v":"leer"},{"$f":"IF(E80=0,\"\",IF(I80=0,\"Jahrgang fehlt\",IF(YEAR(I80)>'Hilfstab AE'!$B$16,0,IF(AND(YEAR(I80)<('Hilfstab AE'!$B$16+1),YEAR(I80)>('Hilfstab AE'!$D$16-1)),\"AE56-60\",\"AE61+\"))))","v":""},"leer ",{"$f":"IF(N80=\"ja\",IF(AND(M80>24.999%,M80<50.001%),'Hilfstab Auswahl SOPÄ'!$J$5/2,IF(M80>50%,'Hilfstab Auswahl SOPÄ'!$J$5,0)),0)","v":{"v":0,"d":"0.000%"}}]
["Auswählen","Auswählen",{"$nulls":5},"Auswählen",null,"Auswählen","Auswählen",{"$nulls":3},"Auswählen","Auswählen",{"$f":"VLOOKUP(O81&P81,CHOOSE({1,2},'Hilfstab Löhne'!$A$3:$A$187&'Hilfstab Löhne'!$B$3:$B$187,'Hilfstab Löhne'!$D$3:$D$187),2,0)","v":0},0,{"v":0,"d":"0.000%"},{"$f":"ROUND(IF(S81=0,0,IF(OR(S81='Hilfstab Auswahl SOPÄ'!$L$6,S81='Hilfstab Auswahl SOPÄ'!$L$8),IF(M81>1,'Hilfstab Auswahl SOPÄ'!$M$6,'Hilfstab Auswahl SOPÄ'!$M$6*M81),IF(OR(S81='Hilfstab Auswahl SOPÄ'!$L$7,S81='Hilfstab Auswahl SOPÄ'!$L$9),IF(M81>1,'Hilfstab Auswahl SOPÄ'!$M$7,'Hilfstab Auswahl SOPÄ'!$M$7*M81),IF(S81='Hilfstab Auswahl SOPÄ'!$L$10,IF(M81>1,'Hilfstab Auswahl SOPÄ'!$M$10,'Hilfstab Auswahl SOPÄ'!$M$10*M81),IF(M81>1,'Hilfstab Auswahl SOPÄ'!$M$11,'Hilfstab Auswahl SOPÄ'!$M$11*M81))))),5)+AE81","v":{"v":0,"d":"0.000%"}},{"$f":"IF(V81=\"ja\",\"ja\",IF(O81=0,0,IF(OR(O81='Hilfstab Auswahl SOPÄ'!$C$7,O81='Hilfstab Auswahl SOPÄ'!$C$6,O81='Hilfstab Auswahl SOPÄ'!$C$13),\"ja\",\"nein\")))","v":"nein"},null,null,{"$f":"IF(OR(O81='Hilfstab Auswahl SOPÄ'!$C$11,O81='Hilfstab Auswahl SOPÄ'!$C$12)*AND(P81>1),\"* genehmigungspflichtige LK\",0)","v":0},null,"",0,{"$f":"VLOOKUP($A81,'Hilfstab Auswahl SOPÄ'!$G$6:$H$9,2,FALSE)","v":"leer"},{"$f":"IF(E81=0,\"\",IF(I81=0,\"Jahrgang fehlt\",IF(YEAR(I81)>'Hilfstab AE'!$B$16,0,IF(AND(YEAR(I81)<('Hilfstab AE'!$B$16+1),YEAR(I81)>('Hilfstab AE'!$D$16-1)),\"AE56-60\",\"AE61+\"))))","v":""},"leer ",{"$f":"IF(N81=\"ja\",IF(AND(M81>24.999%,M81<50.001%),'Hilfstab Auswahl SOPÄ'!$J$5/2,IF(M81>50%,'Hilfstab Auswahl SOPÄ'!$J$5,0)),0)","v":{"v":0,"d":"0.000%"}}]
["Auswählen","Auswählen",{"$nulls":5},"Auswählen",null,"Auswählen","Auswählen",{"$nulls":3},"Auswählen","Auswählen",{"$f":"VLOOKUP(O82&P82,CHOOSE({1,2},'Hilfstab Löhne'!$A$3:$A$187&'Hilfstab Löhne'!$B$3:$B$187,'Hilfstab Löhne'!$D$3:$D$187),2,0)","v":0},0,{"$f":"IF(AA82<30%,0,IF(AC82=0,0,IF(AB82<>\"leer\",AD82,0)))","v":{"v":0,"d":"0.000%"}},{"$f":"ROUND(IF(S82=0,0,IF(OR(S82='Hilfstab Auswahl SOPÄ'!$L$6,S82='Hilfstab Auswahl SOPÄ'!$L$8),IF(M82>1,'Hilfstab Auswahl SOPÄ'!$M$6,'Hilfstab Auswahl SOPÄ'!$M$6*M82),IF(OR(S82='Hilfstab Auswahl SOPÄ'!$L$7,S82='Hilfstab Auswahl SOPÄ'!$L$9),IF(M82>1,'Hilfstab Auswahl SOPÄ'!$M$7,'Hilfstab Auswahl SOPÄ'!$M$7*M82),IF(S82='Hilfstab Auswahl SOPÄ'!$L$10,IF(M82>1,'Hilfstab Auswahl SOPÄ'!$M$10,'Hilfstab Auswahl SOPÄ'!$M$10*M82),IF(M82>1,'Hilfstab Auswahl SOPÄ'!$M$11,'Hilfstab Auswahl SOPÄ'!$M$11*M82))))),5)+AE82","v":{"v":0,"d":"0.000%"}},{"$f":"IF(V82=\"ja\",\"ja\",IF(O82=0,0,IF(OR(O82='Hilfstab Auswahl SOPÄ'!$C$7,O82='Hilfstab Auswahl SOPÄ'!$C$6,O82='Hilfstab Auswahl SOPÄ'!$C$13),\"ja\",\"nein\")))","v":"nein"},null,null,{"$f":"IF(OR(O82='Hilfstab Auswahl SOPÄ'!$C$11,O82='Hilfstab Auswahl SOPÄ'!$C$12)*AND(P82>1),\"* genehmigungspflichtige LK\",0)","v":0},null,{"$f":"IF(E82=\"\",\"\",CONCATENATE(E82,F82,I82))","v":""},0,{"$f":"VLOOKUP($A82,'Hilfstab Auswahl SOPÄ'!$G$6:$H$9,2,FALSE)","v":"leer"},{"$f":"IF(E82=0,\"\",IF(I82=0,\"Jahrgang fehlt\",IF(YEAR(I82)>'Hilfstab AE'!$B$16,0,IF(AND(YEAR(I82)<('Hilfstab AE'!$B$16+1),YEAR(I82)>('Hilfstab AE'!$D$16-1)),\"AE56-60\",\"AE61+\"))))","v":""},"leer ",{"$f":"IF(N82=\"ja\",IF(AND(M82>24.999%,M82<50.001%),'Hilfstab Auswahl SOPÄ'!$J$5/2,IF(M82>50%,'Hilfstab Auswahl SOPÄ'!$J$5,0)),0)","v":{"v":0,"d":"0.000%"}}]
["Auswählen","Auswählen",{"$nulls":5},"Auswählen",null,"Auswählen","Auswählen",{"$nulls":3},"Auswählen","Auswählen",{"$f":"VLOOKUP(O83&P83,CHOOSE({1,2},'Hilfstab Löhne'!$A$3:$A$187&'Hilfstab Löhne'!$B$3:$B$187,'Hilfstab Löhne'!$D$3:$D$187),2,0)","v":0},0,{"v":0,"d":"0.000%"},{"$f":"ROUND(IF(S83=0,0,IF(OR(S83='Hilfstab Auswahl SOPÄ'!$L$6,S83='Hilfstab Auswahl SOPÄ'!$L$8),IF(M83>1,'Hilfstab Auswahl SOPÄ'!$M$6,'Hilfstab Auswahl SOPÄ'!$M$6*M83),IF(OR(S83='Hilfstab Auswahl SOPÄ'!$L$7,S83='Hilfstab Auswahl SOPÄ'!$L$9),IF(M83>1,'Hilfstab Auswahl SOPÄ'!$M$7,'Hilfstab Auswahl SOPÄ'!$M$7*M83),IF(S83='Hilfstab Auswahl SOPÄ'!$L$10,IF(M83>1,'Hilfstab Auswahl SOPÄ'!$M$10,'Hilfstab Auswahl SOPÄ'!$M$10*M83),IF(M83>1,'Hilfstab Auswahl SOPÄ'!$M$11,'Hilfstab Auswahl SOPÄ'!$M$11*M83))))),5)+AE83","v":{"v":0,"d":"0.000%"}},{"$f":"IF(V83=\"ja\",\"ja\",IF(O83=0,0,IF(OR(O83='Hilfstab Auswahl SOPÄ'!$C$7,O83='Hilfstab Auswahl SOPÄ'!$C$6,O83='Hilfstab Auswahl SOPÄ'!$C$13),\"ja\",\"nein\")))","v":"nein"},null,null,{"$f":"IF(OR(O83='Hilfstab Auswahl SOPÄ'!$C$11,O83='Hilfstab Auswahl SOPÄ'!$C$12)*AND(P83>1),\"* genehmigungspflichtige LK\",0)","v":0},null,"",0,{"$f":"VLOOKUP($A83,'Hilfstab Auswahl SOPÄ'!$G$6:$H$9,2,FALSE)","v":"leer"},{"$f":"IF(E83=0,\"\",IF(I83=0,\"Jahrgang fehlt\",IF(YEAR(I83)>'Hilfstab AE'!$B$16,0,IF(AND(YEAR(I83)<('Hilfstab AE'!$B$16+1),YEAR(I83)>('Hilfstab AE'!$D$16-1)),\"AE56-60\",\"AE61+\"))))","v":""},"leer ",{"$f":"IF(N83=\"ja\",IF(AND(M83>24.999%,M83<50.001%),'Hilfstab Auswahl SOPÄ'!$J$5/2,IF(M83>50%,'Hilfstab Auswahl SOPÄ'!$J$5,0)),0)","v":{"v":0,"d":"0.000%"}}]
["Auswählen","Auswählen",{"$nulls":5},"Auswählen",null,"Auswählen","Auswählen",{"$nulls":3},"Auswählen","Auswählen",{"$f":"VLOOKUP(O84&P84,CHOOSE({1,2},'Hilfstab Löhne'!$A$3:$A$187&'Hilfstab Löhne'!$B$3:$B$187,'Hilfstab Löhne'!$D$3:$D$187),2,0)","v":0},0,{"v":0,"d":"0.000%"},{"$f":"ROUND(IF(S84=0,0,IF(OR(S84='Hilfstab Auswahl SOPÄ'!$L$6,S84='Hilfstab Auswahl SOPÄ'!$L$8),IF(M84>1,'Hilfstab Auswahl SOPÄ'!$M$6,'Hilfstab Auswahl SOPÄ'!$M$6*M84),IF(OR(S84='Hilfstab Auswahl SOPÄ'!$L$7,S84='Hilfstab Auswahl SOPÄ'!$L$9),IF(M84>1,'Hilfstab Auswahl SOPÄ'!$M$7,'Hilfstab Auswahl SOPÄ'!$M$7*M84),IF(S84='Hilfstab Auswahl SOPÄ'!$L$10,IF(M84>1,'Hilfstab Auswahl SOPÄ'!$M$10,'Hilfstab Auswahl SOPÄ'!$M$10*M84),IF(M84>1,'Hilfstab Auswahl SOPÄ'!$M$11,'Hilfstab Auswahl SOPÄ'!$M$11*M84))))),5)+AE84","v":{"v":0,"d":"0.000%"}},{"$f":"IF(V84=\"ja\",\"ja\",IF(O84=0,0,IF(OR(O84='Hilfstab Auswahl SOPÄ'!$C$7,O84='Hilfstab Auswahl SOPÄ'!$C$6,O84='Hilfstab Auswahl SOPÄ'!$C$13),\"ja\",\"nein\")))","v":"nein"},null,null,{"$f":"IF(OR(O84='Hilfstab Auswahl SOPÄ'!$C$11,O84='Hilfstab Auswahl SOPÄ'!$C$12)*AND(P84>1),\"* genehmigungspflichtige LK\",0)","v":0},null,"",0,{"$f":"VLOOKUP($A84,'Hilfstab Auswahl SOPÄ'!$G$6:$H$9,2,FALSE)","v":"leer"},{"$f":"IF(E84=0,\"\",IF(I84=0,\"Jahrgang fehlt\",IF(YEAR(I84)>'Hilfstab AE'!$B$16,0,IF(AND(YEAR(I84)<('Hilfstab AE'!$B$16+1),YEAR(I84)>('Hilfstab AE'!$D$16-1)),\"AE56-60\",\"AE61+\"))))","v":""},"leer ",{"$f":"IF(N84=\"ja\",IF(AND(M84>24.999%,M84<50.001%),'Hilfstab Auswahl SOPÄ'!$J$5/2,IF(M84>50%,'Hilfstab Auswahl SOPÄ'!$J$5,0)),0)","v":{"v":0,"d":"0.000%"}}]
["Auswählen","Auswählen",{"$nulls":5},"Auswählen",null,"Auswählen","Auswählen",{"$nulls":3},"Auswählen","Auswählen",{"$f":"VLOOKUP(O85&P85,CHOOSE({1,2},'Hilfstab Löhne'!$A$3:$A$187&'Hilfstab Löhne'!$B$3:$B$187,'Hilfstab Löhne'!$D$3:$D$187),2,0)","v":0},{"$f":"IF(Q85=\"ungültige Lohnklasse\",0,M85*Q85)","v":0},{"v":0,"d":"0.000%"},{"$f":"ROUND(IF(S85=0,0,IF(OR(S85='Hilfstab Auswahl SOPÄ'!$L$6,S85='Hilfstab Auswahl SOPÄ'!$L$8),IF(M85>1,'Hilfstab Auswahl SOPÄ'!$M$6,'Hilfstab Auswahl SOPÄ'!$M$6*M85),IF(OR(S85='Hilfstab Auswahl SOPÄ'!$L$7,S85='Hilfstab Auswahl SOPÄ'!$L$9),IF(M85>1,'Hilfstab Auswahl SOPÄ'!$M$7,'Hilfstab Auswahl SOPÄ'!$M$7*M85),IF(S85='Hilfstab Auswahl SOPÄ'!$L$10,IF(M85>1,'Hilfstab Auswahl SOPÄ'!$M$10,'Hilfstab Auswahl SOPÄ'!$M$10*M85),IF(M85>1,'Hilfstab Auswahl SOPÄ'!$M$11,'Hilfstab Auswahl SOPÄ'!$M$11*M85))))),5)+AE85","v":{"v":0,"d":"0.000%"}},{"$f":"IF(V85=\"ja\",\"ja\",IF(O85=0,0,IF(OR(O85='Hilfstab Auswahl SOPÄ'!$C$7,O85='Hilfstab Auswahl SOPÄ'!$C$6,O85='Hilfstab Auswahl SOPÄ'!$C$13),\"ja\",\"nein\")))","v":"nein"},null,null,{"$f":"IF(OR(O85='Hilfstab Auswahl SOPÄ'!$C$11,O85='Hilfstab Auswahl SOPÄ'!$C$12)*AND(P85>1),\"* genehmigungspflichtige LK\",0)","v":0},null,"",{"$f":"SUMIF(Z$17:Z$166,Z85,M$17:M$166)","v":0},{"$f":"VLOOKUP($A85,'Hilfstab Auswahl SOPÄ'!$G$6:$H$9,2,FALSE)","v":"leer"},{"$f":"IF(E85=0,\"\",IF(I85=0,\"Jahrgang fehlt\",IF(YEAR(I85)>'Hilfstab AE'!$B$16,0,IF(AND(YEAR(I85)<('Hilfstab AE'!$B$16+1),YEAR(I85)>('Hilfstab AE'!$D$16-1)),\"AE56-60\",\"AE61+\"))))","v":""},{"$f":"AB85&\" \"&AC85","v":"leer "},{"$f":"IF(N85=\"ja\",IF(AND(M85>24.999%,M85<50.001%),'Hilfstab Auswahl SOPÄ'!$J$5/2,IF(M85>50%,'Hilfstab Auswahl SOPÄ'!$J$5,0)),0)","v":{"v":0,"d":"0.000%"}}]
["Auswählen","Auswählen",{"$nulls":5},"Auswählen",null,"Auswählen","Auswählen",{"$nulls":3},"Auswählen","Auswählen",{"$f":"VLOOKUP(O86&P86,CHOOSE({1,2},'Hilfstab Löhne'!$A$3:$A$187&'Hilfstab Löhne'!$B$3:$B$187,'Hilfstab Löhne'!$D$3:$D$187),2,0)","v":0},0,{"v":0,"d":"0.000%"},{"$f":"ROUND(IF(S86=0,0,IF(OR(S86='Hilfstab Auswahl SOPÄ'!$L$6,S86='Hilfstab Auswahl SOPÄ'!$L$8),IF(M86>1,'Hilfstab Auswahl SOPÄ'!$M$6,'Hilfstab Auswahl SOPÄ'!$M$6*M86),IF(OR(S86='Hilfstab Auswahl SOPÄ'!$L$7,S86='Hilfstab Auswahl SOPÄ'!$L$9),IF(M86>1,'Hilfstab Auswahl SOPÄ'!$M$7,'Hilfstab Auswahl SOPÄ'!$M$7*M86),IF(S86='Hilfstab Auswahl SOPÄ'!$L$10,IF(M86>1,'Hilfstab Auswahl SOPÄ'!$M$10,'Hilfstab Auswahl SOPÄ'!$M$10*M86),IF(M86>1,'Hilfstab Auswahl SOPÄ'!$M$11,'Hilfstab Auswahl SOPÄ'!$M$11*M86))))),5)+AE86","v":{"v":0,"d":"0.000%"}},{"$f":"IF(V86=\"ja\",\"ja\",IF(O86=0,0,IF(OR(O86='Hilfstab Auswahl SOPÄ'!$C$7,O86='Hilfstab Auswahl SOPÄ'!$C$6,O86='Hilfstab Auswahl SOPÄ'!$C$13),\"ja\",\"nein\")))","v":"nein"},null,null,{"$f":"IF(OR(O86='Hilfstab Auswahl SOPÄ'!$C$11,O86='Hilfstab Auswahl SOPÄ'!$C$12)*AND(P86>1),\"* genehmigungspflichtige LK\",0)","v":0},null,"",0,{"$f":"VLOOKUP($A86,'Hilfstab Auswahl SOPÄ'!$G$6:$H$9,2,FALSE)","v":"leer"},{"$f":"IF(E86=0,\"\",IF(I86=0,\"Jahrgang fehlt\",IF(YEAR(I86)>'Hilfstab AE'!$B$16,0,IF(AND(YEAR(I86)<('Hilfstab AE'!$B$16+1),YEAR(I86)>('Hilfstab AE'!$D$16-1)),\"AE56-60\",\"AE61+\"))))","v":""},"leer ",{"$f":"IF(N86=\"ja\",IF(AND(M86>24.999%,M86<50.001%),'Hilfstab Auswahl SOPÄ'!$J$5/2,IF(M86>50%,'Hilfstab Auswahl SOPÄ'!$J$5,0)),0)","v":{"v":0,"d":"0.000%"}}]
["Auswählen","Auswählen",{"$nulls":5},"Auswählen",null,"Auswählen","Auswählen",{"$nulls":3},"Auswählen","Auswählen",{"$f":"VLOOKUP(O87&P87,CHOOSE({1,2},'Hilfstab Löhne'!$A$3:$A$187&'Hilfstab Löhne'!$B$3:$B$187,'Hilfstab Löhne'!$D$3:$D$187),2,0)","v":0},0,{"v":0,"d":"0.000%"},{"$f":"ROUND(IF(S87=0,0,IF(OR(S87='Hilfstab Auswahl SOPÄ'!$L$6,S87='Hilfstab Auswahl SOPÄ'!$L$8),IF(M87>1,'Hilfstab Auswahl SOPÄ'!$M$6,'Hilfstab Auswahl SOPÄ'!$M$6*M87),IF(OR(S87='Hilfstab Auswahl SOPÄ'!$L$7,S87='Hilfstab Auswahl SOPÄ'!$L$9),IF(M87>1,'Hilfstab Auswahl SOPÄ'!$M$7,'Hilfstab Auswahl SOPÄ'!$M$7*M87),IF(S87='Hilfstab Auswahl SOPÄ'!$L$10,IF(M87>1,'Hilfstab Auswahl SOPÄ'!$M$10,'Hilfstab Auswahl SOPÄ'!$M$10*M87),IF(M87>1,'Hilfstab Auswahl SOPÄ'!$M$11,'Hilfstab Auswahl SOPÄ'!$M$11*M87))))),5)+AE87","v":{"v":0,"d":"0.000%"}},{"$f":"IF(V87=\"ja\",\"ja\",IF(O87=0,0,IF(OR(O87='Hilfstab Auswahl SOPÄ'!$C$7,O87='Hilfstab Auswahl SOPÄ'!$C$6,O87='Hilfstab Auswahl SOPÄ'!$C$13),\"ja\",\"nein\")))","v":"nein"},null,null,{"$f":"IF(OR(O87='Hilfstab Auswahl SOPÄ'!$C$11,O87='Hilfstab Auswahl SOPÄ'!$C$12)*AND(P87>1),\"* genehmigungspflichtige LK\",0)","v":0},null,"",0,{"$f":"VLOOKUP($A87,'Hilfstab Auswahl SOPÄ'!$G$6:$H$9,2,FALSE)","v":"leer"},{"$f":"IF(E87=0,\"\",IF(I87=0,\"Jahrgang fehlt\",IF(YEAR(I87)>'Hilfstab AE'!$B$16,0,IF(AND(YEAR(I87)<('Hilfstab AE'!$B$16+1),YEAR(I87)>('Hilfstab AE'!$D$16-1)),\"AE56-60\",\"AE61+\"))))","v":""},"leer ",{"$f":"IF(N87=\"ja\",IF(AND(M87>24.999%,M87<50.001%),'Hilfstab Auswahl SOPÄ'!$J$5/2,IF(M87>50%,'Hilfstab Auswahl SOPÄ'!$J$5,0)),0)","v":{"v":0,"d":"0.000%"}}]
["Auswählen","Auswählen",{"$nulls":5},"Auswählen",null,"Auswählen","Auswählen",{"$nulls":3},"Auswählen","Auswählen",{"$f":"VLOOKUP(O88&P88,CHOOSE({1,2},'Hilfstab Löhne'!$A$3:$A$187&'Hilfstab Löhne'!$B$3:$B$187,'Hilfstab Löhne'!$D$3:$D$187),2,0)","v":0},0,{"v":0,"d":"0.000%"},{"$f":"ROUND(IF(S88=0,0,IF(OR(S88='Hilfstab Auswahl SOPÄ'!$L$6,S88='Hilfstab Auswahl SOPÄ'!$L$8),IF(M88>1,'Hilfstab Auswahl SOPÄ'!$M$6,'Hilfstab Auswahl SOPÄ'!$M$6*M88),IF(OR(S88='Hilfstab Auswahl SOPÄ'!$L$7,S88='Hilfstab Auswahl SOPÄ'!$L$9),IF(M88>1,'Hilfstab Auswahl SOPÄ'!$M$7,'Hilfstab Auswahl SOPÄ'!$M$7*M88),IF(S88='Hilfstab Auswahl SOPÄ'!$L$10,IF(M88>1,'Hilfstab Auswahl SOPÄ'!$M$10,'Hilfstab Auswahl SOPÄ'!$M$10*M88),IF(M88>1,'Hilfstab Auswahl SOPÄ'!$M$11,'Hilfstab Auswahl SOPÄ'!$M$11*M88))))),5)+AE88","v":{"v":0,"d":"0.000%"}},{"$f":"IF(V88=\"ja\",\"ja\",IF(O88=0,0,IF(OR(O88='Hilfstab Auswahl SOPÄ'!$C$7,O88='Hilfstab Auswahl SOPÄ'!$C$6,O88='Hilfstab Auswahl SOPÄ'!$C$13),\"ja\",\"nein\")))","v":"nein"},null,null,{"$f":"IF(OR(O88='Hilfstab Auswahl SOPÄ'!$C$11,O88='Hilfstab Auswahl SOPÄ'!$C$12)*AND(P88>1),\"* genehmigungspflichtige LK\",0)","v":0},null,"",0,{"$f":"VLOOKUP($A88,'Hilfstab Auswahl SOPÄ'!$G$6:$H$9,2,FALSE)","v":"leer"},{"$f":"IF(E88=0,\"\",IF(I88=0,\"Jahrgang fehlt\",IF(YEAR(I88)>'Hilfstab AE'!$B$16,0,IF(AND(YEAR(I88)<('Hilfstab AE'!$B$16+1),YEAR(I88)>('Hilfstab AE'!$D$16-1)),\"AE56-60\",\"AE61+\"))))","v":""},"leer ",{"$f":"IF(N88=\"ja\",IF(AND(M88>24.999%,M88<50.001%),'Hilfstab Auswahl SOPÄ'!$J$5/2,IF(M88>50%,'Hilfstab Auswahl SOPÄ'!$J$5,0)),0)","v":{"v":0,"d":"0.000%"}}]
["Auswählen","Auswählen",{"$nulls":5},"Auswählen",null,"Auswählen","Auswählen",{"$nulls":3},"Auswählen","Auswählen",{"$f":"VLOOKUP(O89&P89,CHOOSE({1,2},'Hilfstab Löhne'!$A$3:$A$187&'Hilfstab Löhne'!$B$3:$B$187,'Hilfstab Löhne'!$D$3:$D$187),2,0)","v":0},0,{"v":0,"d":"0.000%"},{"$f":"ROUND(IF(S89=0,0,IF(OR(S89='Hilfstab Auswahl SOPÄ'!$L$6,S89='Hilfstab Auswahl SOPÄ'!$L$8),IF(M89>1,'Hilfstab Auswahl SOPÄ'!$M$6,'Hilfstab Auswahl SOPÄ'!$M$6*M89),IF(OR(S89='Hilfstab Auswahl SOPÄ'!$L$7,S89='Hilfstab Auswahl SOPÄ'!$L$9),IF(M89>1,'Hilfstab Auswahl SOPÄ'!$M$7,'Hilfstab Auswahl SOPÄ'!$M$7*M89),IF(S89='Hilfstab Auswahl SOPÄ'!$L$10,IF(M89>1,'Hilfstab Auswahl SOPÄ'!$M$10,'Hilfstab Auswahl SOPÄ'!$M$10*M89),IF(M89>1,'Hilfstab Auswahl SOPÄ'!$M$11,'Hilfstab Auswahl SOPÄ'!$M$11*M89))))),5)+AE89","v":{"v":0,"d":"0.000%"}},{"$f":"IF(V89=\"ja\",\"ja\",IF(O89=0,0,IF(OR(O89='Hilfstab Auswahl SOPÄ'!$C$7,O89='Hilfstab Auswahl SOPÄ'!$C$6,O89='Hilfstab Auswahl SOPÄ'!$C$13),\"ja\",\"nein\")))","v":"nein"},null,null,{"$f":"IF(OR(O89='Hilfstab Auswahl SOPÄ'!$C$11,O89='Hilfstab Auswahl SOPÄ'!$C$12)*AND(P89>1),\"* genehmigungspflichtige LK\",0)","v":0},null,"",0,{"$f":"VLOOKUP($A89,'Hilfstab Auswahl SOPÄ'!$G$6:$H$9,2,FALSE)","v":"leer"},{"$f":"IF(E89=0,\"\",IF(I89=0,\"Jahrgang fehlt\",IF(YEAR(I89)>'Hilfstab AE'!$B$16,0,IF(AND(YEAR(I89)<('Hilfstab AE'!$B$16+1),YEAR(I89)>('Hilfstab AE'!$D$16-1)),\"AE56-60\",\"AE61+\"))))","v":""},"leer ",{"$f":"IF(N89=\"ja\",IF(AND(M89>24.999%,M89<50.001%),'Hilfstab Auswahl SOPÄ'!$J$5/2,IF(M89>50%,'Hilfstab Auswahl SOPÄ'!$J$5,0)),0)","v":{"v":0,"d":"0.000%"}}]
["Auswählen","Auswählen",{"$nulls":5},"Auswählen",null,"Auswählen","Auswählen",{"$nulls":3},"Auswählen","Auswählen",{"$f":"VLOOKUP(O90&P90,CHOOSE({1,2},'Hilfstab Löhne'!$A$3:$A$187&'Hilfstab Löhne'!$B$3:$B$187,'Hilfstab Löhne'!$D$3:$D$187),2,0)","v":0},0,{"v":0,"d":"0.000%"},{"$f":"ROUND(IF(S90=0,0,IF(OR(S90='Hilfstab Auswahl SOPÄ'!$L$6,S90='Hilfstab Auswahl SOPÄ'!$L$8),IF(M90>1,'Hilfstab Auswahl SOPÄ'!$M$6,'Hilfstab Auswahl SOPÄ'!$M$6*M90),IF(OR(S90='Hilfstab Auswahl SOPÄ'!$L$7,S90='Hilfstab Auswahl SOPÄ'!$L$9),IF(M90>1,'Hilfstab Auswahl SOPÄ'!$M$7,'Hilfstab Auswahl SOPÄ'!$M$7*M90),IF(S90='Hilfstab Auswahl SOPÄ'!$L$10,IF(M90>1,'Hilfstab Auswahl SOPÄ'!$M$10,'Hilfstab Auswahl SOPÄ'!$M$10*M90),IF(M90>1,'Hilfstab Auswahl SOPÄ'!$M$11,'Hilfstab Auswahl SOPÄ'!$M$11*M90))))),5)+AE90","v":{"v":0,"d":"0.000%"}},{"$f":"IF(V90=\"ja\",\"ja\",IF(O90=0,0,IF(OR(O90='Hilfstab Auswahl SOPÄ'!$C$7,O90='Hilfstab Auswahl SOPÄ'!$C$6,O90='Hilfstab Auswahl SOPÄ'!$C$13),\"ja\",\"nein\")))","v":"nein"},null,null,{"$f":"IF(OR(O90='Hilfstab Auswahl SOPÄ'!$C$11,O90='Hilfstab Auswahl SOPÄ'!$C$12)*AND(P90>1),\"* genehmigungspflichtige LK\",0)","v":0},null,"",0,{"$f":"VLOOKUP($A90,'Hilfstab Auswahl SOPÄ'!$G$6:$H$9,2,FALSE)","v":"leer"},{"$f":"IF(E90=0,\"\",IF(I90=0,\"Jahrgang fehlt\",IF(YEAR(I90)>'Hilfstab AE'!$B$16,0,IF(AND(YEAR(I90)<('Hilfstab AE'!$B$16+1),YEAR(I90)>('Hilfstab AE'!$D$16-1)),\"AE56-60\",\"AE61+\"))))","v":""},"leer ",{"$f":"IF(N90=\"ja\",IF(AND(M90>24.999%,M90<50.001%),'Hilfstab Auswahl SOPÄ'!$J$5/2,IF(M90>50%,'Hilfstab Auswahl SOPÄ'!$J$5,0)),0)","v":{"v":0,"d":"0.000%"}}]
["Auswählen","Auswählen",{"$nulls":5},"Auswählen",null,"Auswählen","Auswählen",{"$nulls":3},"Auswählen","Auswählen",{"$f":"VLOOKUP(O91&P91,CHOOSE({1,2},'Hilfstab Löhne'!$A$3:$A$187&'Hilfstab Löhne'!$B$3:$B$187,'Hilfstab Löhne'!$D$3:$D$187),2,0)","v":0},0,{"v":0,"d":"0.000%"},{"$f":"ROUND(IF(S91=0,0,IF(OR(S91='Hilfstab Auswahl SOPÄ'!$L$6,S91='Hilfstab Auswahl SOPÄ'!$L$8),IF(M91>1,'Hilfstab Auswahl SOPÄ'!$M$6,'Hilfstab Auswahl SOPÄ'!$M$6*M91),IF(OR(S91='Hilfstab Auswahl SOPÄ'!$L$7,S91='Hilfstab Auswahl SOPÄ'!$L$9),IF(M91>1,'Hilfstab Auswahl SOPÄ'!$M$7,'Hilfstab Auswahl SOPÄ'!$M$7*M91),IF(S91='Hilfstab Auswahl SOPÄ'!$L$10,IF(M91>1,'Hilfstab Auswahl SOPÄ'!$M$10,'Hilfstab Auswahl SOPÄ'!$M$10*M91),IF(M91>1,'Hilfstab Auswahl SOPÄ'!$M$11,'Hilfstab Auswahl SOPÄ'!$M$11*M91))))),5)+AE91","v":{"v":0,"d":"0.000%"}},{"$f":"IF(V91=\"ja\",\"ja\",IF(O91=0,0,IF(OR(O91='Hilfstab Auswahl SOPÄ'!$C$7,O91='Hilfstab Auswahl SOPÄ'!$C$6,O91='Hilfstab Auswahl SOPÄ'!$C$13),\"ja\",\"nein\")))","v":"nein"},null,null,{"$f":"IF(OR(O91='Hilfstab Auswahl SOPÄ'!$C$11,O91='Hilfstab Auswahl SOPÄ'!$C$12)*AND(P91>1),\"* genehmigungspflichtige LK\",0)","v":0},null,"",0,{"$f":"VLOOKUP($A91,'Hilfstab Auswahl SOPÄ'!$G$6:$H$9,2,FALSE)","v":"leer"},{"$f":"IF(E91=0,\"\",IF(I91=0,\"Jahrgang fehlt\",IF(YEAR(I91)>'Hilfstab AE'!$B$16,0,IF(AND(YEAR(I91)<('Hilfstab AE'!$B$16+1),YEAR(I91)>('Hilfstab AE'!$D$16-1)),\"AE56-60\",\"AE61+\"))))","v":""},"leer ",{"$f":"IF(N91=\"ja\",IF(AND(M91>24.999%,M91<50.001%),'Hilfstab Auswahl SOPÄ'!$J$5/2,IF(M91>50%,'Hilfstab Auswahl SOPÄ'!$J$5,0)),0)","v":{"v":0,"d":"0.000%"}}]
["Auswählen","Auswählen",{"$nulls":5},"Auswählen",null,"Auswählen","Auswählen",{"$nulls":3},"Auswählen","Auswählen",{"$f":"VLOOKUP(O92&P92,CHOOSE({1,2},'Hilfstab Löhne'!$A$3:$A$187&'Hilfstab Löhne'!$B$3:$B$187,'Hilfstab Löhne'!$D$3:$D$187),2,0)","v":0},0,{"v":0,"d":"0.000%"},{"$f":"ROUND(IF(S92=0,0,IF(OR(S92='Hilfstab Auswahl SOPÄ'!$L$6,S92='Hilfstab Auswahl SOPÄ'!$L$8),IF(M92>1,'Hilfstab Auswahl SOPÄ'!$M$6,'Hilfstab Auswahl SOPÄ'!$M$6*M92),IF(OR(S92='Hilfstab Auswahl SOPÄ'!$L$7,S92='Hilfstab Auswahl SOPÄ'!$L$9),IF(M92>1,'Hilfstab Auswahl SOPÄ'!$M$7,'Hilfstab Auswahl SOPÄ'!$M$7*M92),IF(S92='Hilfstab Auswahl SOPÄ'!$L$10,IF(M92>1,'Hilfstab Auswahl SOPÄ'!$M$10,'Hilfstab Auswahl SOPÄ'!$M$10*M92),IF(M92>1,'Hilfstab Auswahl SOPÄ'!$M$11,'Hilfstab Auswahl SOPÄ'!$M$11*M92))))),5)+AE92","v":{"v":0,"d":"0.000%"}},{"$f":"IF(V92=\"ja\",\"ja\",IF(O92=0,0,IF(OR(O92='Hilfstab Auswahl SOPÄ'!$C$7,O92='Hilfstab Auswahl SOPÄ'!$C$6,O92='Hilfstab Auswahl SOPÄ'!$C$13),\"ja\",\"nein\")))","v":"nein"},null,null,{"$f":"IF(OR(O92='Hilfstab Auswahl SOPÄ'!$C$11,O92='Hilfstab Auswahl SOPÄ'!$C$12)*AND(P92>1),\"* genehmigungspflichtige LK\",0)","v":0},null,"",0,{"$f":"VLOOKUP($A92,'Hilfstab Auswahl SOPÄ'!$G$6:$H$9,2,FALSE)","v":"leer"},{"$f":"IF(E92=0,\"\",IF(I92=0,\"Jahrgang fehlt\",IF(YEAR(I92)>'Hilfstab AE'!$B$16,0,IF(AND(YEAR(I92)<('Hilfstab AE'!$B$16+1),YEAR(I92)>('Hilfstab AE'!$D$16-1)),\"AE56-60\",\"AE61+\"))))","v":""},"leer ",{"$f":"IF(N92=\"ja\",IF(AND(M92>24.999%,M92<50.001%),'Hilfstab Auswahl SOPÄ'!$J$5/2,IF(M92>50%,'Hilfstab Auswahl SOPÄ'!$J$5,0)),0)","v":{"v":0,"d":"0.000%"}}]
["Auswählen","Auswählen",{"$nulls":5},"Auswählen",null,"Auswählen","Auswählen",{"$nulls":3},"Auswählen","Auswählen",{"$f":"VLOOKUP(O93&P93,CHOOSE({1,2},'Hilfstab Löhne'!$A$3:$A$187&'Hilfstab Löhne'!$B$3:$B$187,'Hilfstab Löhne'!$D$3:$D$187),2,0)","v":0},0,{"v":0,"d":"0.000%"},{"$f":"ROUND(IF(S93=0,0,IF(OR(S93='Hilfstab Auswahl SOPÄ'!$L$6,S93='Hilfstab Auswahl SOPÄ'!$L$8),IF(M93>1,'Hilfstab Auswahl SOPÄ'!$M$6,'Hilfstab Auswahl SOPÄ'!$M$6*M93),IF(OR(S93='Hilfstab Auswahl SOPÄ'!$L$7,S93='Hilfstab Auswahl SOPÄ'!$L$9),IF(M93>1,'Hilfstab Auswahl SOPÄ'!$M$7,'Hilfstab Auswahl SOPÄ'!$M$7*M93),IF(S93='Hilfstab Auswahl SOPÄ'!$L$10,IF(M93>1,'Hilfstab Auswahl SOPÄ'!$M$10,'Hilfstab Auswahl SOPÄ'!$M$10*M93),IF(M93>1,'Hilfstab Auswahl SOPÄ'!$M$11,'Hilfstab Auswahl SOPÄ'!$M$11*M93))))),5)+AE93","v":{"v":0,"d":"0.000%"}},{"$f":"IF(V93=\"ja\",\"ja\",IF(O93=0,0,IF(OR(O93='Hilfstab Auswahl SOPÄ'!$C$7,O93='Hilfstab Auswahl SOPÄ'!$C$6,O93='Hilfstab Auswahl SOPÄ'!$C$13),\"ja\",\"nein\")))","v":"nein"},null,null,{"$f":"IF(OR(O93='Hilfstab Auswahl SOPÄ'!$C$11,O93='Hilfstab Auswahl SOPÄ'!$C$12)*AND(P93>1),\"* genehmigungspflichtige LK\",0)","v":0},null,"",0,{"$f":"VLOOKUP($A93,'Hilfstab Auswahl SOPÄ'!$G$6:$H$9,2,FALSE)","v":"leer"},{"$f":"IF(E93=0,\"\",IF(I93=0,\"Jahrgang fehlt\",IF(YEAR(I93)>'Hilfstab AE'!$B$16,0,IF(AND(YEAR(I93)<('Hilfstab AE'!$B$16+1),YEAR(I93)>('Hilfstab AE'!$D$16-1)),\"AE56-60\",\"AE61+\"))))","v":""},"leer ",{"$f":"IF(N93=\"ja\",IF(AND(M93>24.999%,M93<50.001%),'Hilfstab Auswahl SOPÄ'!$J$5/2,IF(M93>50%,'Hilfstab Auswahl SOPÄ'!$J$5,0)),0)","v":{"v":0,"d":"0.000%"}}]
["Auswählen","Auswählen",{"$nulls":5},"Auswählen",null,"Auswählen","Auswählen",{"$nulls":3},"Auswählen","Auswählen",{"$f":"VLOOKUP(O94&P94,CHOOSE({1,2},'Hilfstab Löhne'!$A$3:$A$187&'Hilfstab Löhne'!$B$3:$B$187,'Hilfstab Löhne'!$D$3:$D$187),2,0)","v":0},0,{"v":0,"d":"0.000%"},{"$f":"ROUND(IF(S94=0,0,IF(OR(S94='Hilfstab Auswahl SOPÄ'!$L$6,S94='Hilfstab Auswahl SOPÄ'!$L$8),IF(M94>1,'Hilfstab Auswahl SOPÄ'!$M$6,'Hilfstab Auswahl SOPÄ'!$M$6*M94),IF(OR(S94='Hilfstab Auswahl SOPÄ'!$L$7,S94='Hilfstab Auswahl SOPÄ'!$L$9),IF(M94>1,'Hilfstab Auswahl SOPÄ'!$M$7,'Hilfstab Auswahl SOPÄ'!$M$7*M94),IF(S94='Hilfstab Auswahl SOPÄ'!$L$10,IF(M94>1,'Hilfstab Auswahl SOPÄ'!$M$10,'Hilfstab Auswahl SOPÄ'!$M$10*M94),IF(M94>1,'Hilfstab Auswahl SOPÄ'!$M$11,'Hilfstab Auswahl SOPÄ'!$M$11*M94))))),5)+AE94","v":{"v":0,"d":"0.000%"}},{"$f":"IF(V94=\"ja\",\"ja\",IF(O94=0,0,IF(OR(O94='Hilfstab Auswahl SOPÄ'!$C$7,O94='Hilfstab Auswahl SOPÄ'!$C$6,O94='Hilfstab Auswahl SOPÄ'!$C$13),\"ja\",\"nein\")))","v":"nein"},null,null,{"$f":"IF(OR(O94='Hilfstab Auswahl SOPÄ'!$C$11,O94='Hilfstab Auswahl SOPÄ'!$C$12)*AND(P94>1),\"* genehmigungspflichtige LK\",0)","v":0},null,"",0,{"$f":"VLOOKUP($A94,'Hilfstab Auswahl SOPÄ'!$G$6:$H$9,2,FALSE)","v":"leer"},{"$f":"IF(E94=0,\"\",IF(I94=0,\"Jahrgang fehlt\",IF(YEAR(I94)>'Hilfstab AE'!$B$16,0,IF(AND(YEAR(I94)<('Hilfstab AE'!$B$16+1),YEAR(I94)>('Hilfstab AE'!$D$16-1)),\"AE56-60\",\"AE61+\"))))","v":""},"leer ",{"$f":"IF(N94=\"ja\",IF(AND(M94>24.999%,M94<50.001%),'Hilfstab Auswahl SOPÄ'!$J$5/2,IF(M94>50%,'Hilfstab Auswahl SOPÄ'!$J$5,0)),0)","v":{"v":0,"d":"0.000%"}}]
["Auswählen","Auswählen",{"$nulls":5},"Auswählen",null,"Auswählen","Auswählen",{"$nulls":3},"Auswählen","Auswählen",{"$f":"VLOOKUP(O95&P95,CHOOSE({1,2},'Hilfstab Löhne'!$A$3:$A$187&'Hilfstab Löhne'!$B$3:$B$187,'Hilfstab Löhne'!$D$3:$D$187),2,0)","v":0},0,{"v":0,"d":"0.000%"},{"$f":"ROUND(IF(S95=0,0,IF(OR(S95='Hilfstab Auswahl SOPÄ'!$L$6,S95='Hilfstab Auswahl SOPÄ'!$L$8),IF(M95>1,'Hilfstab Auswahl SOPÄ'!$M$6,'Hilfstab Auswahl SOPÄ'!$M$6*M95),IF(OR(S95='Hilfstab Auswahl SOPÄ'!$L$7,S95='Hilfstab Auswahl SOPÄ'!$L$9),IF(M95>1,'Hilfstab Auswahl SOPÄ'!$M$7,'Hilfstab Auswahl SOPÄ'!$M$7*M95),IF(S95='Hilfstab Auswahl SOPÄ'!$L$10,IF(M95>1,'Hilfstab Auswahl SOPÄ'!$M$10,'Hilfstab Auswahl SOPÄ'!$M$10*M95),IF(M95>1,'Hilfstab Auswahl SOPÄ'!$M$11,'Hilfstab Auswahl SOPÄ'!$M$11*M95))))),5)+AE95","v":{"v":0,"d":"0.000%"}},{"$f":"IF(V95=\"ja\",\"ja\",IF(O95=0,0,IF(OR(O95='Hilfstab Auswahl SOPÄ'!$C$7,O95='Hilfstab Auswahl SOPÄ'!$C$6,O95='Hilfstab Auswahl SOPÄ'!$C$13),\"ja\",\"nein\")))","v":"nein"},null,null,{"$f":"IF(OR(O95='Hilfstab Auswahl SOPÄ'!$C$11,O95='Hilfstab Auswahl SOPÄ'!$C$12)*AND(P95>1),\"* genehmigungspflichtige LK\",0)","v":0},null,"",0,{"$f":"VLOOKUP($A95,'Hilfstab Auswahl SOPÄ'!$G$6:$H$9,2,FALSE)","v":"leer"},{"$f":"IF(E95=0,\"\",IF(I95=0,\"Jahrgang fehlt\",IF(YEAR(I95)>'Hilfstab AE'!$B$16,0,IF(AND(YEAR(I95)<('Hilfstab AE'!$B$16+1),YEAR(I95)>('Hilfstab AE'!$D$16-1)),\"AE56-60\",\"AE61+\"))))","v":""},"leer ",{"$f":"IF(N95=\"ja\",IF(AND(M95>24.999%,M95<50.001%),'Hilfstab Auswahl SOPÄ'!$J$5/2,IF(M95>50%,'Hilfstab Auswahl SOPÄ'!$J$5,0)),0)","v":{"v":0,"d":"0.000%"}}]
["Auswählen","Auswählen",{"$nulls":5},"Auswählen",null,"Auswählen","Auswählen",{"$nulls":3},"Auswählen","Auswählen",{"$f":"VLOOKUP(O96&P96,CHOOSE({1,2},'Hilfstab Löhne'!$A$3:$A$187&'Hilfstab Löhne'!$B$3:$B$187,'Hilfstab Löhne'!$D$3:$D$187),2,0)","v":0},0,{"v":0,"d":"0.000%"},{"$f":"ROUND(IF(S96=0,0,IF(OR(S96='Hilfstab Auswahl SOPÄ'!$L$6,S96='Hilfstab Auswahl SOPÄ'!$L$8),IF(M96>1,'Hilfstab Auswahl SOPÄ'!$M$6,'Hilfstab Auswahl SOPÄ'!$M$6*M96),IF(OR(S96='Hilfstab Auswahl SOPÄ'!$L$7,S96='Hilfstab Auswahl SOPÄ'!$L$9),IF(M96>1,'Hilfstab Auswahl SOPÄ'!$M$7,'Hilfstab Auswahl SOPÄ'!$M$7*M96),IF(S96='Hilfstab Auswahl SOPÄ'!$L$10,IF(M96>1,'Hilfstab Auswahl SOPÄ'!$M$10,'Hilfstab Auswahl SOPÄ'!$M$10*M96),IF(M96>1,'Hilfstab Auswahl SOPÄ'!$M$11,'Hilfstab Auswahl SOPÄ'!$M$11*M96))))),5)+AE96","v":{"v":0,"d":"0.000%"}},{"$f":"IF(V96=\"ja\",\"ja\",IF(O96=0,0,IF(OR(O96='Hilfstab Auswahl SOPÄ'!$C$7,O96='Hilfstab Auswahl SOPÄ'!$C$6,O96='Hilfstab Auswahl SOPÄ'!$C$13),\"ja\",\"nein\")))","v":"nein"},null,null,{"$f":"IF(OR(O96='Hilfstab Auswahl SOPÄ'!$C$11,O96='Hilfstab Auswahl SOPÄ'!$C$12)*AND(P96>1),\"* genehmigungspflichtige LK\",0)","v":0},null,"",0,{"$f":"VLOOKUP($A96,'Hilfstab Auswahl SOPÄ'!$G$6:$H$9,2,FALSE)","v":"leer"},{"$f":"IF(E96=0,\"\",IF(I96=0,\"Jahrgang fehlt\",IF(YEAR(I96)>'Hilfstab AE'!$B$16,0,IF(AND(YEAR(I96)<('Hilfstab AE'!$B$16+1),YEAR(I96)>('Hilfstab AE'!$D$16-1)),\"AE56-60\",\"AE61+\"))))","v":""},"leer ",{"$f":"IF(N96=\"ja\",IF(AND(M96>24.999%,M96<50.001%),'Hilfstab Auswahl SOPÄ'!$J$5/2,IF(M96>50%,'Hilfstab Auswahl SOPÄ'!$J$5,0)),0)","v":{"v":0,"d":"0.000%"}}]
["Auswählen","Auswählen",{"$nulls":5},"Auswählen",null,"Auswählen","Auswählen",{"$nulls":3},"Auswählen","Auswählen",{"$f":"VLOOKUP(O97&P97,CHOOSE({1,2},'Hilfstab Löhne'!$A$3:$A$187&'Hilfstab Löhne'!$B$3:$B$187,'Hilfstab Löhne'!$D$3:$D$187),2,0)","v":0},0,{"v":0,"d":"0.000%"},{"$f":"ROUND(IF(S97=0,0,IF(OR(S97='Hilfstab Auswahl SOPÄ'!$L$6,S97='Hilfstab Auswahl SOPÄ'!$L$8),IF(M97>1,'Hilfstab Auswahl SOPÄ'!$M$6,'Hilfstab Auswahl SOPÄ'!$M$6*M97),IF(OR(S97='Hilfstab Auswahl SOPÄ'!$L$7,S97='Hilfstab Auswahl SOPÄ'!$L$9),IF(M97>1,'Hilfstab Auswahl SOPÄ'!$M$7,'Hilfstab Auswahl SOPÄ'!$M$7*M97),IF(S97='Hilfstab Auswahl SOPÄ'!$L$10,IF(M97>1,'Hilfstab Auswahl SOPÄ'!$M$10,'Hilfstab Auswahl SOPÄ'!$M$10*M97),IF(M97>1,'Hilfstab Auswahl SOPÄ'!$M$11,'Hilfstab Auswahl SOPÄ'!$M$11*M97))))),5)+AE97","v":{"v":0,"d":"0.000%"}},{"$f":"IF(V97=\"ja\",\"ja\",IF(O97=0,0,IF(OR(O97='Hilfstab Auswahl SOPÄ'!$C$7,O97='Hilfstab Auswahl SOPÄ'!$C$6,O97='Hilfstab Auswahl SOPÄ'!$C$13),\"ja\",\"nein\")))","v":"nein"},null,null,{"$f":"IF(OR(O97='Hilfstab Auswahl SOPÄ'!$C$11,O97='Hilfstab Auswahl SOPÄ'!$C$12)*AND(P97>1),\"* genehmigungspflichtige LK\",0)","v":0},null,"",0,{"$f":"VLOOKUP($A97,'Hilfstab Auswahl SOPÄ'!$G$6:$H$9,2,FALSE)","v":"leer"},{"$f":"IF(E97=0,\"\",IF(I97=0,\"Jahrgang fehlt\",IF(YEAR(I97)>'Hilfstab AE'!$B$16,0,IF(AND(YEAR(I97)<('Hilfstab AE'!$B$16+1),YEAR(I97)>('Hilfstab AE'!$D$16-1)),\"AE56-60\",\"AE61+\"))))","v":""},"leer ",{"$f":"IF(N97=\"ja\",IF(AND(M97>24.999%,M97<50.001%),'Hilfstab Auswahl SOPÄ'!$J$5/2,IF(M97>50%,'Hilfstab Auswahl SOPÄ'!$J$5,0)),0)","v":{"v":0,"d":"0.000%"}}]
["Auswählen","Auswählen",{"$nulls":5},"Auswählen",null,"Auswählen","Auswählen",{"$nulls":3},"Auswählen","Auswählen",{"$f":"VLOOKUP(O98&P98,CHOOSE({1,2},'Hilfstab Löhne'!$A$3:$A$187&'Hilfstab Löhne'!$B$3:$B$187,'Hilfstab Löhne'!$D$3:$D$187),2,0)","v":0},0,{"v":0,"d":"0.000%"},{"$f":"ROUND(IF(S98=0,0,IF(OR(S98='Hilfstab Auswahl SOPÄ'!$L$6,S98='Hilfstab Auswahl SOPÄ'!$L$8),IF(M98>1,'Hilfstab Auswahl SOPÄ'!$M$6,'Hilfstab Auswahl SOPÄ'!$M$6*M98),IF(OR(S98='Hilfstab Auswahl SOPÄ'!$L$7,S98='Hilfstab Auswahl SOPÄ'!$L$9),IF(M98>1,'Hilfstab Auswahl SOPÄ'!$M$7,'Hilfstab Auswahl SOPÄ'!$M$7*M98),IF(S98='Hilfstab Auswahl SOPÄ'!$L$10,IF(M98>1,'Hilfstab Auswahl SOPÄ'!$M$10,'Hilfstab Auswahl SOPÄ'!$M$10*M98),IF(M98>1,'Hilfstab Auswahl SOPÄ'!$M$11,'Hilfstab Auswahl SOPÄ'!$M$11*M98))))),5)+AE98","v":{"v":0,"d":"0.000%"}},{"$f":"IF(V98=\"ja\",\"ja\",IF(O98=0,0,IF(OR(O98='Hilfstab Auswahl SOPÄ'!$C$7,O98='Hilfstab Auswahl SOPÄ'!$C$6,O98='Hilfstab Auswahl SOPÄ'!$C$13),\"ja\",\"nein\")))","v":"nein"},null,null,{"$f":"IF(OR(O98='Hilfstab Auswahl SOPÄ'!$C$11,O98='Hilfstab Auswahl SOPÄ'!$C$12)*AND(P98>1),\"* genehmigungspflichtige LK\",0)","v":0},null,"",0,{"$f":"VLOOKUP($A98,'Hilfstab Auswahl SOPÄ'!$G$6:$H$9,2,FALSE)","v":"leer"},{"$f":"IF(E98=0,\"\",IF(I98=0,\"Jahrgang fehlt\",IF(YEAR(I98)>'Hilfstab AE'!$B$16,0,IF(AND(YEAR(I98)<('Hilfstab AE'!$B$16+1),YEAR(I98)>('Hilfstab AE'!$D$16-1)),\"AE56-60\",\"AE61+\"))))","v":""},"leer ",{"$f":"IF(N98=\"ja\",IF(AND(M98>24.999%,M98<50.001%),'Hilfstab Auswahl SOPÄ'!$J$5/2,IF(M98>50%,'Hilfstab Auswahl SOPÄ'!$J$5,0)),0)","v":{"v":0,"d":"0.000%"}}]
["Auswählen","Auswählen",{"$nulls":5},"Auswählen",null,"Auswählen","Auswählen",{"$nulls":3},"Auswählen","Auswählen",{"$f":"VLOOKUP(O99&P99,CHOOSE({1,2},'Hilfstab Löhne'!$A$3:$A$187&'Hilfstab Löhne'!$B$3:$B$187,'Hilfstab Löhne'!$D$3:$D$187),2,0)","v":0},0,{"v":0,"d":"0.000%"},{"$f":"ROUND(IF(S99=0,0,IF(OR(S99='Hilfstab Auswahl SOPÄ'!$L$6,S99='Hilfstab Auswahl SOPÄ'!$L$8),IF(M99>1,'Hilfstab Auswahl SOPÄ'!$M$6,'Hilfstab Auswahl SOPÄ'!$M$6*M99),IF(OR(S99='Hilfstab Auswahl SOPÄ'!$L$7,S99='Hilfstab Auswahl SOPÄ'!$L$9),IF(M99>1,'Hilfstab Auswahl SOPÄ'!$M$7,'Hilfstab Auswahl SOPÄ'!$M$7*M99),IF(S99='Hilfstab Auswahl SOPÄ'!$L$10,IF(M99>1,'Hilfstab Auswahl SOPÄ'!$M$10,'Hilfstab Auswahl SOPÄ'!$M$10*M99),IF(M99>1,'Hilfstab Auswahl SOPÄ'!$M$11,'Hilfstab Auswahl SOPÄ'!$M$11*M99))))),5)+AE99","v":{"v":0,"d":"0.000%"}},{"$f":"IF(V99=\"ja\",\"ja\",IF(O99=0,0,IF(OR(O99='Hilfstab Auswahl SOPÄ'!$C$7,O99='Hilfstab Auswahl SOPÄ'!$C$6,O99='Hilfstab Auswahl SOPÄ'!$C$13),\"ja\",\"nein\")))","v":"nein"},null,null,{"$f":"IF(OR(O99='Hilfstab Auswahl SOPÄ'!$C$11,O99='Hilfstab Auswahl SOPÄ'!$C$12)*AND(P99>1),\"* genehmigungspflichtige LK\",0)","v":0},null,"",0,{"$f":"VLOOKUP($A99,'Hilfstab Auswahl SOPÄ'!$G$6:$H$9,2,FALSE)","v":"leer"},{"$f":"IF(E99=0,\"\",IF(I99=0,\"Jahrgang fehlt\",IF(YEAR(I99)>'Hilfstab AE'!$B$16,0,IF(AND(YEAR(I99)<('Hilfstab AE'!$B$16+1),YEAR(I99)>('Hilfstab AE'!$D$16-1)),\"AE56-60\",\"AE61+\"))))","v":""},"leer ",{"$f":"IF(N99=\"ja\",IF(AND(M99>24.999%,M99<50.001%),'Hilfstab Auswahl SOPÄ'!$J$5/2,IF(M99>50%,'Hilfstab Auswahl SOPÄ'!$J$5,0)),0)","v":{"v":0,"d":"0.000%"}}]
["Auswählen","Auswählen",{"$nulls":5},"Auswählen",null,"Auswählen","Auswählen",{"$nulls":3},"Auswählen","Auswählen",{"$f":"VLOOKUP(O100&P100,CHOOSE({1,2},'Hilfstab Löhne'!$A$3:$A$187&'Hilfstab Löhne'!$B$3:$B$187,'Hilfstab Löhne'!$D$3:$D$187),2,0)","v":0},0,{"v":0,"d":"0.000%"},{"$f":"ROUND(IF(S100=0,0,IF(OR(S100='Hilfstab Auswahl SOPÄ'!$L$6,S100='Hilfstab Auswahl SOPÄ'!$L$8),IF(M100>1,'Hilfstab Auswahl SOPÄ'!$M$6,'Hilfstab Auswahl SOPÄ'!$M$6*M100),IF(OR(S100='Hilfstab Auswahl SOPÄ'!$L$7,S100='Hilfstab Auswahl SOPÄ'!$L$9),IF(M100>1,'Hilfstab Auswahl SOPÄ'!$M$7,'Hilfstab Auswahl SOPÄ'!$M$7*M100),IF(S100='Hilfstab Auswahl SOPÄ'!$L$10,IF(M100>1,'Hilfstab Auswahl SOPÄ'!$M$10,'Hilfstab Auswahl SOPÄ'!$M$10*M100),IF(M100>1,'Hilfstab Auswahl SOPÄ'!$M$11,'Hilfstab Auswahl SOPÄ'!$M$11*M100))))),5)+AE100","v":{"v":0,"d":"0.000%"}},{"$f":"IF(V100=\"ja\",\"ja\",IF(O100=0,0,IF(OR(O100='Hilfstab Auswahl SOPÄ'!$C$7,O100='Hilfstab Auswahl SOPÄ'!$C$6,O100='Hilfstab Auswahl SOPÄ'!$C$13),\"ja\",\"nein\")))","v":"nein"},null,null,{"$f":"IF(OR(O100='Hilfstab Auswahl SOPÄ'!$C$11,O100='Hilfstab Auswahl SOPÄ'!$C$12)*AND(P100>1),\"* genehmigungspflichtige LK\",0)","v":0},null,"",0,{"$f":"VLOOKUP($A100,'Hilfstab Auswahl SOPÄ'!$G$6:$H$9,2,FALSE)","v":"leer"},{"$f":"IF(E100=0,\"\",IF(I100=0,\"Jahrgang fehlt\",IF(YEAR(I100)>'Hilfstab AE'!$B$16,0,IF(AND(YEAR(I100)<('Hilfstab AE'!$B$16+1),YEAR(I100)>('Hilfstab AE'!$D$16-1)),\"AE56-60\",\"AE61+\"))))","v":""},"leer ",{"$f":"IF(N100=\"ja\",IF(AND(M100>24.999%,M100<50.001%),'Hilfstab Auswahl SOPÄ'!$J$5/2,IF(M100>50%,'Hilfstab Auswahl SOPÄ'!$J$5,0)),0)","v":{"v":0,"d":"0.000%"}}]
["Auswählen","Auswählen",{"$nulls":5},"Auswählen",null,"Auswählen","Auswählen",{"$nulls":3},"Auswählen","Auswählen",{"$f":"VLOOKUP(O101&P101,CHOOSE({1,2},'Hilfstab Löhne'!$A$3:$A$187&'Hilfstab Löhne'!$B$3:$B$187,'Hilfstab Löhne'!$D$3:$D$187),2,0)","v":0},0,{"v":0,"d":"0.000%"},{"$f":"ROUND(IF(S101=0,0,IF(OR(S101='Hilfstab Auswahl SOPÄ'!$L$6,S101='Hilfstab Auswahl SOPÄ'!$L$8),IF(M101>1,'Hilfstab Auswahl SOPÄ'!$M$6,'Hilfstab Auswahl SOPÄ'!$M$6*M101),IF(OR(S101='Hilfstab Auswahl SOPÄ'!$L$7,S101='Hilfstab Auswahl SOPÄ'!$L$9),IF(M101>1,'Hilfstab Auswahl SOPÄ'!$M$7,'Hilfstab Auswahl SOPÄ'!$M$7*M101),IF(S101='Hilfstab Auswahl SOPÄ'!$L$10,IF(M101>1,'Hilfstab Auswahl SOPÄ'!$M$10,'Hilfstab Auswahl SOPÄ'!$M$10*M101),IF(M101>1,'Hilfstab Auswahl SOPÄ'!$M$11,'Hilfstab Auswahl SOPÄ'!$M$11*M101))))),5)+AE101","v":{"v":0,"d":"0.000%"}},{"$f":"IF(V101=\"ja\",\"ja\",IF(O101=0,0,IF(OR(O101='Hilfstab Auswahl SOPÄ'!$C$7,O101='Hilfstab Auswahl SOPÄ'!$C$6,O101='Hilfstab Auswahl SOPÄ'!$C$13),\"ja\",\"nein\")))","v":"nein"},null,null,{"$f":"IF(OR(O101='Hilfstab Auswahl SOPÄ'!$C$11,O101='Hilfstab Auswahl SOPÄ'!$C$12)*AND(P101>1),\"* genehmigungspflichtige LK\",0)","v":0},null,"",0,{"$f":"VLOOKUP($A101,'Hilfstab Auswahl SOPÄ'!$G$6:$H$9,2,FALSE)","v":"leer"},{"$f":"IF(E101=0,\"\",IF(I101=0,\"Jahrgang fehlt\",IF(YEAR(I101)>'Hilfstab AE'!$B$16,0,IF(AND(YEAR(I101)<('Hilfstab AE'!$B$16+1),YEAR(I101)>('Hilfstab AE'!$D$16-1)),\"AE56-60\",\"AE61+\"))))","v":""},"leer ",{"$f":"IF(N101=\"ja\",IF(AND(M101>24.999%,M101<50.001%),'Hilfstab Auswahl SOPÄ'!$J$5/2,IF(M101>50%,'Hilfstab Auswahl SOPÄ'!$J$5,0)),0)","v":{"v":0,"d":"0.000%"}}]
["Auswählen","Auswählen",{"$nulls":5},"Auswählen",null,"Auswählen","Auswählen",{"$nulls":3},"Auswählen","Auswählen",{"$f":"VLOOKUP(O102&P102,CHOOSE({1,2},'Hilfstab Löhne'!$A$3:$A$187&'Hilfstab Löhne'!$B$3:$B$187,'Hilfstab Löhne'!$D$3:$D$187),2,0)","v":0},0,{"v":0,"d":"0.000%"},{"$f":"ROUND(IF(S102=0,0,IF(OR(S102='Hilfstab Auswahl SOPÄ'!$L$6,S102='Hilfstab Auswahl SOPÄ'!$L$8),IF(M102>1,'Hilfstab Auswahl SOPÄ'!$M$6,'Hilfstab Auswahl SOPÄ'!$M$6*M102),IF(OR(S102='Hilfstab Auswahl SOPÄ'!$L$7,S102='Hilfstab Auswahl SOPÄ'!$L$9),IF(M102>1,'Hilfstab Auswahl SOPÄ'!$M$7,'Hilfstab Auswahl SOPÄ'!$M$7*M102),IF(S102='Hilfstab Auswahl SOPÄ'!$L$10,IF(M102>1,'Hilfstab Auswahl SOPÄ'!$M$10,'Hilfstab Auswahl SOPÄ'!$M$10*M102),IF(M102>1,'Hilfstab Auswahl SOPÄ'!$M$11,'Hilfstab Auswahl SOPÄ'!$M$11*M102))))),5)+AE102","v":{"v":0,"d":"0.000%"}},{"$f":"IF(V102=\"ja\",\"ja\",IF(O102=0,0,IF(OR(O102='Hilfstab Auswahl SOPÄ'!$C$7,O102='Hilfstab Auswahl SOPÄ'!$C$6,O102='Hilfstab Auswahl SOPÄ'!$C$13),\"ja\",\"nein\")))","v":"nein"},null,null,{"$f":"IF(OR(O102='Hilfstab Auswahl SOPÄ'!$C$11,O102='Hilfstab Auswahl SOPÄ'!$C$12)*AND(P102>1),\"* genehmigungspflichtige LK\",0)","v":0},null,"",0,{"$f":"VLOOKUP($A102,'Hilfstab Auswahl SOPÄ'!$G$6:$H$9,2,FALSE)","v":"leer"},{"$f":"IF(E102=0,\"\",IF(I102=0,\"Jahrgang fehlt\",IF(YEAR(I102)>'Hilfstab AE'!$B$16,0,IF(AND(YEAR(I102)<('Hilfstab AE'!$B$16+1),YEAR(I102)>('Hilfstab AE'!$D$16-1)),\"AE56-60\",\"AE61+\"))))","v":""},"leer ",{"$f":"IF(N102=\"ja\",IF(AND(M102>24.999%,M102<50.001%),'Hilfstab Auswahl SOPÄ'!$J$5/2,IF(M102>50%,'Hilfstab Auswahl SOPÄ'!$J$5,0)),0)","v":{"v":0,"d":"0.000%"}}]
["Auswählen","Auswählen",{"$nulls":5},"Auswählen",null,"Auswählen","Auswählen",{"$nulls":3},"Auswählen","Auswählen",{"$f":"VLOOKUP(O103&P103,CHOOSE({1,2},'Hilfstab Löhne'!$A$3:$A$187&'Hilfstab Löhne'!$B$3:$B$187,'Hilfstab Löhne'!$D$3:$D$187),2,0)","v":0},0,{"v":0,"d":"0.000%"},{"$f":"ROUND(IF(S103=0,0,IF(OR(S103='Hilfstab Auswahl SOPÄ'!$L$6,S103='Hilfstab Auswahl SOPÄ'!$L$8),IF(M103>1,'Hilfstab Auswahl SOPÄ'!$M$6,'Hilfstab Auswahl SOPÄ'!$M$6*M103),IF(OR(S103='Hilfstab Auswahl SOPÄ'!$L$7,S103='Hilfstab Auswahl SOPÄ'!$L$9),IF(M103>1,'Hilfstab Auswahl SOPÄ'!$M$7,'Hilfstab Auswahl SOPÄ'!$M$7*M103),IF(S103='Hilfstab Auswahl SOPÄ'!$L$10,IF(M103>1,'Hilfstab Auswahl SOPÄ'!$M$10,'Hilfstab Auswahl SOPÄ'!$M$10*M103),IF(M103>1,'Hilfstab Auswahl SOPÄ'!$M$11,'Hilfstab Auswahl SOPÄ'!$M$11*M103))))),5)+AE103","v":{"v":0,"d":"0.000%"}},{"$f":"IF(V103=\"ja\",\"ja\",IF(O103=0,0,IF(OR(O103='Hilfstab Auswahl SOPÄ'!$C$7,O103='Hilfstab Auswahl SOPÄ'!$C$6,O103='Hilfstab Auswahl SOPÄ'!$C$13),\"ja\",\"nein\")))","v":"nein"},null,null,{"$f":"IF(OR(O103='Hilfstab Auswahl SOPÄ'!$C$11,O103='Hilfstab Auswahl SOPÄ'!$C$12)*AND(P103>1),\"* genehmigungspflichtige LK\",0)","v":0},null,"",0,{"$f":"VLOOKUP($A103,'Hilfstab Auswahl SOPÄ'!$G$6:$H$9,2,FALSE)","v":"leer"},{"$f":"IF(E103=0,\"\",IF(I103=0,\"Jahrgang fehlt\",IF(YEAR(I103)>'Hilfstab AE'!$B$16,0,IF(AND(YEAR(I103)<('Hilfstab AE'!$B$16+1),YEAR(I103)>('Hilfstab AE'!$D$16-1)),\"AE56-60\",\"AE61+\"))))","v":""},"leer ",{"$f":"IF(N103=\"ja\",IF(AND(M103>24.999%,M103<50.001%),'Hilfstab Auswahl SOPÄ'!$J$5/2,IF(M103>50%,'Hilfstab Auswahl SOPÄ'!$J$5,0)),0)","v":{"v":0,"d":"0.000%"}}]
["Auswählen","Auswählen",{"$nulls":5},"Auswählen",null,"Auswählen","Auswählen",{"$nulls":3},"Auswählen","Auswählen",{"$f":"VLOOKUP(O104&P104,CHOOSE({1,2},'Hilfstab Löhne'!$A$3:$A$187&'Hilfstab Löhne'!$B$3:$B$187,'Hilfstab Löhne'!$D$3:$D$187),2,0)","v":0},0,{"v":0,"d":"0.000%"},{"$f":"ROUND(IF(S104=0,0,IF(OR(S104='Hilfstab Auswahl SOPÄ'!$L$6,S104='Hilfstab Auswahl SOPÄ'!$L$8),IF(M104>1,'Hilfstab Auswahl SOPÄ'!$M$6,'Hilfstab Auswahl SOPÄ'!$M$6*M104),IF(OR(S104='Hilfstab Auswahl SOPÄ'!$L$7,S104='Hilfstab Auswahl SOPÄ'!$L$9),IF(M104>1,'Hilfstab Auswahl SOPÄ'!$M$7,'Hilfstab Auswahl SOPÄ'!$M$7*M104),IF(S104='Hilfstab Auswahl SOPÄ'!$L$10,IF(M104>1,'Hilfstab Auswahl SOPÄ'!$M$10,'Hilfstab Auswahl SOPÄ'!$M$10*M104),IF(M104>1,'Hilfstab Auswahl SOPÄ'!$M$11,'Hilfstab Auswahl SOPÄ'!$M$11*M104))))),5)+AE104","v":{"v":0,"d":"0.000%"}},{"$f":"IF(V104=\"ja\",\"ja\",IF(O104=0,0,IF(OR(O104='Hilfstab Auswahl SOPÄ'!$C$7,O104='Hilfstab Auswahl SOPÄ'!$C$6,O104='Hilfstab Auswahl SOPÄ'!$C$13),\"ja\",\"nein\")))","v":"nein"},null,null,{"$f":"IF(OR(O104='Hilfstab Auswahl SOPÄ'!$C$11,O104='Hilfstab Auswahl SOPÄ'!$C$12)*AND(P104>1),\"* genehmigungspflichtige LK\",0)","v":0},null,"",0,{"$f":"VLOOKUP($A104,'Hilfstab Auswahl SOPÄ'!$G$6:$H$9,2,FALSE)","v":"leer"},{"$f":"IF(E104=0,\"\",IF(I104=0,\"Jahrgang fehlt\",IF(YEAR(I104)>'Hilfstab AE'!$B$16,0,IF(AND(YEAR(I104)<('Hilfstab AE'!$B$16+1),YEAR(I104)>('Hilfstab AE'!$D$16-1)),\"AE56-60\",\"AE61+\"))))","v":""},"leer ",{"$f":"IF(N104=\"ja\",IF(AND(M104>24.999%,M104<50.001%),'Hilfstab Auswahl SOPÄ'!$J$5/2,IF(M104>50%,'Hilfstab Auswahl SOPÄ'!$J$5,0)),0)","v":{"v":0,"d":"0.000%"}}]
["Auswählen","Auswählen",{"$nulls":5},"Auswählen",null,"Auswählen","Auswählen",{"$nulls":3},"Auswählen","Auswählen",{"$f":"VLOOKUP(O105&P105,CHOOSE({1,2},'Hilfstab Löhne'!$A$3:$A$187&'Hilfstab Löhne'!$B$3:$B$187,'Hilfstab Löhne'!$D$3:$D$187),2,0)","v":0},0,{"v":0,"d":"0.000%"},{"$f":"ROUND(IF(S105=0,0,IF(OR(S105='Hilfstab Auswahl SOPÄ'!$L$6,S105='Hilfstab Auswahl SOPÄ'!$L$8),IF(M105>1,'Hilfstab Auswahl SOPÄ'!$M$6,'Hilfstab Auswahl SOPÄ'!$M$6*M105),IF(OR(S105='Hilfstab Auswahl SOPÄ'!$L$7,S105='Hilfstab Auswahl SOPÄ'!$L$9),IF(M105>1,'Hilfstab Auswahl SOPÄ'!$M$7,'Hilfstab Auswahl SOPÄ'!$M$7*M105),IF(S105='Hilfstab Auswahl SOPÄ'!$L$10,IF(M105>1,'Hilfstab Auswahl SOPÄ'!$M$10,'Hilfstab Auswahl SOPÄ'!$M$10*M105),IF(M105>1,'Hilfstab Auswahl SOPÄ'!$M$11,'Hilfstab Auswahl SOPÄ'!$M$11*M105))))),5)+AE105","v":{"v":0,"d":"0.000%"}},{"$f":"IF(V105=\"ja\",\"ja\",IF(O105=0,0,IF(OR(O105='Hilfstab Auswahl SOPÄ'!$C$7,O105='Hilfstab Auswahl SOPÄ'!$C$6,O105='Hilfstab Auswahl SOPÄ'!$C$13),\"ja\",\"nein\")))","v":"nein"},null,null,{"$f":"IF(OR(O105='Hilfstab Auswahl SOPÄ'!$C$11,O105='Hilfstab Auswahl SOPÄ'!$C$12)*AND(P105>1),\"* genehmigungspflichtige LK\",0)","v":0},null,"",0,{"$f":"VLOOKUP($A105,'Hilfstab Auswahl SOPÄ'!$G$6:$H$9,2,FALSE)","v":"leer"},{"$f":"IF(E105=0,\"\",IF(I105=0,\"Jahrgang fehlt\",IF(YEAR(I105)>'Hilfstab AE'!$B$16,0,IF(AND(YEAR(I105)<('Hilfstab AE'!$B$16+1),YEAR(I105)>('Hilfstab AE'!$D$16-1)),\"AE56-60\",\"AE61+\"))))","v":""},"leer ",{"$f":"IF(N105=\"ja\",IF(AND(M105>24.999%,M105<50.001%),'Hilfstab Auswahl SOPÄ'!$J$5/2,IF(M105>50%,'Hilfstab Auswahl SOPÄ'!$J$5,0)),0)","v":{"v":0,"d":"0.000%"}}]
["Auswählen","Auswählen",{"$nulls":5},"Auswählen",null,"Auswählen","Auswählen",{"$nulls":3},"Auswählen","Auswählen",{"$f":"VLOOKUP(O106&P106,CHOOSE({1,2},'Hilfstab Löhne'!$A$3:$A$187&'Hilfstab Löhne'!$B$3:$B$187,'Hilfstab Löhne'!$D$3:$D$187),2,0)","v":0},0,{"v":0,"d":"0.000%"},{"$f":"ROUND(IF(S106=0,0,IF(OR(S106='Hilfstab Auswahl SOPÄ'!$L$6,S106='Hilfstab Auswahl SOPÄ'!$L$8),IF(M106>1,'Hilfstab Auswahl SOPÄ'!$M$6,'Hilfstab Auswahl SOPÄ'!$M$6*M106),IF(OR(S106='Hilfstab Auswahl SOPÄ'!$L$7,S106='Hilfstab Auswahl SOPÄ'!$L$9),IF(M106>1,'Hilfstab Auswahl SOPÄ'!$M$7,'Hilfstab Auswahl SOPÄ'!$M$7*M106),IF(S106='Hilfstab Auswahl SOPÄ'!$L$10,IF(M106>1,'Hilfstab Auswahl SOPÄ'!$M$10,'Hilfstab Auswahl SOPÄ'!$M$10*M106),IF(M106>1,'Hilfstab Auswahl SOPÄ'!$M$11,'Hilfstab Auswahl SOPÄ'!$M$11*M106))))),5)+AE106","v":{"v":0,"d":"0.000%"}},{"$f":"IF(V106=\"ja\",\"ja\",IF(O106=0,0,IF(OR(O106='Hilfstab Auswahl SOPÄ'!$C$7,O106='Hilfstab Auswahl SOPÄ'!$C$6,O106='Hilfstab Auswahl SOPÄ'!$C$13),\"ja\",\"nein\")))","v":"nein"},null,null,{"$f":"IF(OR(O106='Hilfstab Auswahl SOPÄ'!$C$11,O106='Hilfstab Auswahl SOPÄ'!$C$12)*AND(P106>1),\"* genehmigungspflichtige LK\",0)","v":0},null,"",0,{"$f":"VLOOKUP($A106,'Hilfstab Auswahl SOPÄ'!$G$6:$H$9,2,FALSE)","v":"leer"},{"$f":"IF(E106=0,\"\",IF(I106=0,\"Jahrgang fehlt\",IF(YEAR(I106)>'Hilfstab AE'!$B$16,0,IF(AND(YEAR(I106)<('Hilfstab AE'!$B$16+1),YEAR(I106)>('Hilfstab AE'!$D$16-1)),\"AE56-60\",\"AE61+\"))))","v":""},"leer ",{"$f":"IF(N106=\"ja\",IF(AND(M106>24.999%,M106<50.001%),'Hilfstab Auswahl SOPÄ'!$J$5/2,IF(M106>50%,'Hilfstab Auswahl SOPÄ'!$J$5,0)),0)","v":{"v":0,"d":"0.000%"}}]
["Auswählen","Auswählen",{"$nulls":5},"Auswählen",null,"Auswählen","Auswählen",{"$nulls":3},"Auswählen","Auswählen",{"$f":"VLOOKUP(O107&P107,CHOOSE({1,2},'Hilfstab Löhne'!$A$3:$A$187&'Hilfstab Löhne'!$B$3:$B$187,'Hilfstab Löhne'!$D$3:$D$187),2,0)","v":0},0,{"v":0,"d":"0.000%"},{"$f":"ROUND(IF(S107=0,0,IF(OR(S107='Hilfstab Auswahl SOPÄ'!$L$6,S107='Hilfstab Auswahl SOPÄ'!$L$8),IF(M107>1,'Hilfstab Auswahl SOPÄ'!$M$6,'Hilfstab Auswahl SOPÄ'!$M$6*M107),IF(OR(S107='Hilfstab Auswahl SOPÄ'!$L$7,S107='Hilfstab Auswahl SOPÄ'!$L$9),IF(M107>1,'Hilfstab Auswahl SOPÄ'!$M$7,'Hilfstab Auswahl SOPÄ'!$M$7*M107),IF(S107='Hilfstab Auswahl SOPÄ'!$L$10,IF(M107>1,'Hilfstab Auswahl SOPÄ'!$M$10,'Hilfstab Auswahl SOPÄ'!$M$10*M107),IF(M107>1,'Hilfstab Auswahl SOPÄ'!$M$11,'Hilfstab Auswahl SOPÄ'!$M$11*M107))))),5)+AE107","v":{"v":0,"d":"0.000%"}},{"$f":"IF(V107=\"ja\",\"ja\",IF(O107=0,0,IF(OR(O107='Hilfstab Auswahl SOPÄ'!$C$7,O107='Hilfstab Auswahl SOPÄ'!$C$6,O107='Hilfstab Auswahl SOPÄ'!$C$13),\"ja\",\"nein\")))","v":"nein"},null,null,{"$f":"IF(OR(O107='Hilfstab Auswahl SOPÄ'!$C$11,O107='Hilfstab Auswahl SOPÄ'!$C$12)*AND(P107>1),\"* genehmigungspflichtige LK\",0)","v":0},null,"",0,{"$f":"VLOOKUP($A107,'Hilfstab Auswahl SOPÄ'!$G$6:$H$9,2,FALSE)","v":"leer"},{"$f":"IF(E107=0,\"\",IF(I107=0,\"Jahrgang fehlt\",IF(YEAR(I107)>'Hilfstab AE'!$B$16,0,IF(AND(YEAR(I107)<('Hilfstab AE'!$B$16+1),YEAR(I107)>('Hilfstab AE'!$D$16-1)),\"AE56-60\",\"AE61+\"))))","v":""},"leer ",{"$f":"IF(N107=\"ja\",IF(AND(M107>24.999%,M107<50.001%),'Hilfstab Auswahl SOPÄ'!$J$5/2,IF(M107>50%,'Hilfstab Auswahl SOPÄ'!$J$5,0)),0)","v":{"v":0,"d":"0.000%"}}]
["Auswählen","Auswählen",{"$nulls":5},"Auswählen",null,"Auswählen","Auswählen",{"$nulls":3},"Auswählen","Auswählen",{"$f":"VLOOKUP(O108&P108,CHOOSE({1,2},'Hilfstab Löhne'!$A$3:$A$187&'Hilfstab Löhne'!$B$3:$B$187,'Hilfstab Löhne'!$D$3:$D$187),2,0)","v":0},0,{"v":0,"d":"0.000%"},{"$f":"ROUND(IF(S108=0,0,IF(OR(S108='Hilfstab Auswahl SOPÄ'!$L$6,S108='Hilfstab Auswahl SOPÄ'!$L$8),IF(M108>1,'Hilfstab Auswahl SOPÄ'!$M$6,'Hilfstab Auswahl SOPÄ'!$M$6*M108),IF(OR(S108='Hilfstab Auswahl SOPÄ'!$L$7,S108='Hilfstab Auswahl SOPÄ'!$L$9),IF(M108>1,'Hilfstab Auswahl SOPÄ'!$M$7,'Hilfstab Auswahl SOPÄ'!$M$7*M108),IF(S108='Hilfstab Auswahl SOPÄ'!$L$10,IF(M108>1,'Hilfstab Auswahl SOPÄ'!$M$10,'Hilfstab Auswahl SOPÄ'!$M$10*M108),IF(M108>1,'Hilfstab Auswahl SOPÄ'!$M$11,'Hilfstab Auswahl SOPÄ'!$M$11*M108))))),5)+AE108","v":{"v":0,"d":"0.000%"}},{"$f":"IF(V108=\"ja\",\"ja\",IF(O108=0,0,IF(OR(O108='Hilfstab Auswahl SOPÄ'!$C$7,O108='Hilfstab Auswahl SOPÄ'!$C$6,O108='Hilfstab Auswahl SOPÄ'!$C$13),\"ja\",\"nein\")))","v":"nein"},null,null,{"$f":"IF(OR(O108='Hilfstab Auswahl SOPÄ'!$C$11,O108='Hilfstab Auswahl SOPÄ'!$C$12)*AND(P108>1),\"* genehmigungspflichtige LK\",0)","v":0},null,"",0,{"$f":"VLOOKUP($A108,'Hilfstab Auswahl SOPÄ'!$G$6:$H$9,2,FALSE)","v":"leer"},{"$f":"IF(E108=0,\"\",IF(I108=0,\"Jahrgang fehlt\",IF(YEAR(I108)>'Hilfstab AE'!$B$16,0,IF(AND(YEAR(I108)<('Hilfstab AE'!$B$16+1),YEAR(I108)>('Hilfstab AE'!$D$16-1)),\"AE56-60\",\"AE61+\"))))","v":""},"leer ",{"$f":"IF(N108=\"ja\",IF(AND(M108>24.999%,M108<50.001%),'Hilfstab Auswahl SOPÄ'!$J$5/2,IF(M108>50%,'Hilfstab Auswahl SOPÄ'!$J$5,0)),0)","v":{"v":0,"d":"0.000%"}}]
["Auswählen","Auswählen",{"$nulls":5},"Auswählen",null,"Auswählen","Auswählen",{"$nulls":3},"Auswählen","Auswählen",{"$f":"VLOOKUP(O109&P109,CHOOSE({1,2},'Hilfstab Löhne'!$A$3:$A$187&'Hilfstab Löhne'!$B$3:$B$187,'Hilfstab Löhne'!$D$3:$D$187),2,0)","v":0},0,{"v":0,"d":"0.000%"},{"$f":"ROUND(IF(S109=0,0,IF(OR(S109='Hilfstab Auswahl SOPÄ'!$L$6,S109='Hilfstab Auswahl SOPÄ'!$L$8),IF(M109>1,'Hilfstab Auswahl SOPÄ'!$M$6,'Hilfstab Auswahl SOPÄ'!$M$6*M109),IF(OR(S109='Hilfstab Auswahl SOPÄ'!$L$7,S109='Hilfstab Auswahl SOPÄ'!$L$9),IF(M109>1,'Hilfstab Auswahl SOPÄ'!$M$7,'Hilfstab Auswahl SOPÄ'!$M$7*M109),IF(S109='Hilfstab Auswahl SOPÄ'!$L$10,IF(M109>1,'Hilfstab Auswahl SOPÄ'!$M$10,'Hilfstab Auswahl SOPÄ'!$M$10*M109),IF(M109>1,'Hilfstab Auswahl SOPÄ'!$M$11,'Hilfstab Auswahl SOPÄ'!$M$11*M109))))),5)+AE109","v":{"v":0,"d":"0.000%"}},{"$f":"IF(V109=\"ja\",\"ja\",IF(O109=0,0,IF(OR(O109='Hilfstab Auswahl SOPÄ'!$C$7,O109='Hilfstab Auswahl SOPÄ'!$C$6,O109='Hilfstab Auswahl SOPÄ'!$C$13),\"ja\",\"nein\")))","v":"nein"},null,null,{"$f":"IF(OR(O109='Hilfstab Auswahl SOPÄ'!$C$11,O109='Hilfstab Auswahl SOPÄ'!$C$12)*AND(P109>1),\"* genehmigungspflichtige LK\",0)","v":0},null,"",0,{"$f":"VLOOKUP($A109,'Hilfstab Auswahl SOPÄ'!$G$6:$H$9,2,FALSE)","v":"leer"},{"$f":"IF(E109=0,\"\",IF(I109=0,\"Jahrgang fehlt\",IF(YEAR(I109)>'Hilfstab AE'!$B$16,0,IF(AND(YEAR(I109)<('Hilfstab AE'!$B$16+1),YEAR(I109)>('Hilfstab AE'!$D$16-1)),\"AE56-60\",\"AE61+\"))))","v":""},"leer ",{"$f":"IF(N109=\"ja\",IF(AND(M109>24.999%,M109<50.001%),'Hilfstab Auswahl SOPÄ'!$J$5/2,IF(M109>50%,'Hilfstab Auswahl SOPÄ'!$J$5,0)),0)","v":{"v":0,"d":"0.000%"}}]
["Auswählen","Auswählen",{"$nulls":5},"Auswählen",null,"Auswählen","Auswählen",{"$nulls":3},"Auswählen","Auswählen",{"$f":"VLOOKUP(O110&P110,CHOOSE({1,2},'Hilfstab Löhne'!$A$3:$A$187&'Hilfstab Löhne'!$B$3:$B$187,'Hilfstab Löhne'!$D$3:$D$187),2,0)","v":0},0,{"v":0,"d":"0.000%"},{"$f":"ROUND(IF(S110=0,0,IF(OR(S110='Hilfstab Auswahl SOPÄ'!$L$6,S110='Hilfstab Auswahl SOPÄ'!$L$8),IF(M110>1,'Hilfstab Auswahl SOPÄ'!$M$6,'Hilfstab Auswahl SOPÄ'!$M$6*M110),IF(OR(S110='Hilfstab Auswahl SOPÄ'!$L$7,S110='Hilfstab Auswahl SOPÄ'!$L$9),IF(M110>1,'Hilfstab Auswahl SOPÄ'!$M$7,'Hilfstab Auswahl SOPÄ'!$M$7*M110),IF(S110='Hilfstab Auswahl SOPÄ'!$L$10,IF(M110>1,'Hilfstab Auswahl SOPÄ'!$M$10,'Hilfstab Auswahl SOPÄ'!$M$10*M110),IF(M110>1,'Hilfstab Auswahl SOPÄ'!$M$11,'Hilfstab Auswahl SOPÄ'!$M$11*M110))))),5)+AE110","v":{"v":0,"d":"0.000%"}},{"$f":"IF(V110=\"ja\",\"ja\",IF(O110=0,0,IF(OR(O110='Hilfstab Auswahl SOPÄ'!$C$7,O110='Hilfstab Auswahl SOPÄ'!$C$6,O110='Hilfstab Auswahl SOPÄ'!$C$13),\"ja\",\"nein\")))","v":"nein"},null,null,{"$f":"IF(OR(O110='Hilfstab Auswahl SOPÄ'!$C$11,O110='Hilfstab Auswahl SOPÄ'!$C$12)*AND(P110>1),\"* genehmigungspflichtige LK\",0)","v":0},null,"",0,{"$f":"VLOOKUP($A110,'Hilfstab Auswahl SOPÄ'!$G$6:$H$9,2,FALSE)","v":"leer"},{"$f":"IF(E110=0,\"\",IF(I110=0,\"Jahrgang fehlt\",IF(YEAR(I110)>'Hilfstab AE'!$B$16,0,IF(AND(YEAR(I110)<('Hilfstab AE'!$B$16+1),YEAR(I110)>('Hilfstab AE'!$D$16-1)),\"AE56-60\",\"AE61+\"))))","v":""},"leer ",{"$f":"IF(N110=\"ja\",IF(AND(M110>24.999%,M110<50.001%),'Hilfstab Auswahl SOPÄ'!$J$5/2,IF(M110>50%,'Hilfstab Auswahl SOPÄ'!$J$5,0)),0)","v":{"v":0,"d":"0.000%"}}]
["Auswählen","Auswählen",{"$nulls":5},"Auswählen",null,"Auswählen","Auswählen",{"$nulls":3},"Auswählen","Auswählen",{"$f":"VLOOKUP(O111&P111,CHOOSE({1,2},'Hilfstab Löhne'!$A$3:$A$187&'Hilfstab Löhne'!$B$3:$B$187,'Hilfstab Löhne'!$D$3:$D$187),2,0)","v":0},0,{"v":0,"d":"0.000%"},{"$f":"ROUND(IF(S111=0,0,IF(OR(S111='Hilfstab Auswahl SOPÄ'!$L$6,S111='Hilfstab Auswahl SOPÄ'!$L$8),IF(M111>1,'Hilfstab Auswahl SOPÄ'!$M$6,'Hilfstab Auswahl SOPÄ'!$M$6*M111),IF(OR(S111='Hilfstab Auswahl SOPÄ'!$L$7,S111='Hilfstab Auswahl SOPÄ'!$L$9),IF(M111>1,'Hilfstab Auswahl SOPÄ'!$M$7,'Hilfstab Auswahl SOPÄ'!$M$7*M111),IF(S111='Hilfstab Auswahl SOPÄ'!$L$10,IF(M111>1,'Hilfstab Auswahl SOPÄ'!$M$10,'Hilfstab Auswahl SOPÄ'!$M$10*M111),IF(M111>1,'Hilfstab Auswahl SOPÄ'!$M$11,'Hilfstab Auswahl SOPÄ'!$M$11*M111))))),5)+AE111","v":{"v":0,"d":"0.000%"}},{"$f":"IF(V111=\"ja\",\"ja\",IF(O111=0,0,IF(OR(O111='Hilfstab Auswahl SOPÄ'!$C$7,O111='Hilfstab Auswahl SOPÄ'!$C$6,O111='Hilfstab Auswahl SOPÄ'!$C$13),\"ja\",\"nein\")))","v":"nein"},null,null,{"$f":"IF(OR(O111='Hilfstab Auswahl SOPÄ'!$C$11,O111='Hilfstab Auswahl SOPÄ'!$C$12)*AND(P111>1),\"* genehmigungspflichtige LK\",0)","v":0},null,"",0,{"$f":"VLOOKUP($A111,'Hilfstab Auswahl SOPÄ'!$G$6:$H$9,2,FALSE)","v":"leer"},{"$f":"IF(E111=0,\"\",IF(I111=0,\"Jahrgang fehlt\",IF(YEAR(I111)>'Hilfstab AE'!$B$16,0,IF(AND(YEAR(I111)<('Hilfstab AE'!$B$16+1),YEAR(I111)>('Hilfstab AE'!$D$16-1)),\"AE56-60\",\"AE61+\"))))","v":""},"leer ",{"$f":"IF(N111=\"ja\",IF(AND(M111>24.999%,M111<50.001%),'Hilfstab Auswahl SOPÄ'!$J$5/2,IF(M111>50%,'Hilfstab Auswahl SOPÄ'!$J$5,0)),0)","v":{"v":0,"d":"0.000%"}}]
["Auswählen","Auswählen",{"$nulls":5},"Auswählen",null,"Auswählen","Auswählen",{"$nulls":3},"Auswählen","Auswählen",{"$f":"VLOOKUP(O112&P112,CHOOSE({1,2},'Hilfstab Löhne'!$A$3:$A$187&'Hilfstab Löhne'!$B$3:$B$187,'Hilfstab Löhne'!$D$3:$D$187),2,0)","v":0},0,{"v":0,"d":"0.000%"},{"$f":"ROUND(IF(S112=0,0,IF(OR(S112='Hilfstab Auswahl SOPÄ'!$L$6,S112='Hilfstab Auswahl SOPÄ'!$L$8),IF(M112>1,'Hilfstab Auswahl SOPÄ'!$M$6,'Hilfstab Auswahl SOPÄ'!$M$6*M112),IF(OR(S112='Hilfstab Auswahl SOPÄ'!$L$7,S112='Hilfstab Auswahl SOPÄ'!$L$9),IF(M112>1,'Hilfstab Auswahl SOPÄ'!$M$7,'Hilfstab Auswahl SOPÄ'!$M$7*M112),IF(S112='Hilfstab Auswahl SOPÄ'!$L$10,IF(M112>1,'Hilfstab Auswahl SOPÄ'!$M$10,'Hilfstab Auswahl SOPÄ'!$M$10*M112),IF(M112>1,'Hilfstab Auswahl SOPÄ'!$M$11,'Hilfstab Auswahl SOPÄ'!$M$11*M112))))),5)+AE112","v":{"v":0,"d":"0.000%"}},{"$f":"IF(V112=\"ja\",\"ja\",IF(O112=0,0,IF(OR(O112='Hilfstab Auswahl SOPÄ'!$C$7,O112='Hilfstab Auswahl SOPÄ'!$C$6,O112='Hilfstab Auswahl SOPÄ'!$C$13),\"ja\",\"nein\")))","v":"nein"},null,null,{"$f":"IF(OR(O112='Hilfstab Auswahl SOPÄ'!$C$11,O112='Hilfstab Auswahl SOPÄ'!$C$12)*AND(P112>1),\"* genehmigungspflichtige LK\",0)","v":0},null,"",0,{"$f":"VLOOKUP($A112,'Hilfstab Auswahl SOPÄ'!$G$6:$H$9,2,FALSE)","v":"leer"},{"$f":"IF(E112=0,\"\",IF(I112=0,\"Jahrgang fehlt\",IF(YEAR(I112)>'Hilfstab AE'!$B$16,0,IF(AND(YEAR(I112)<('Hilfstab AE'!$B$16+1),YEAR(I112)>('Hilfstab AE'!$D$16-1)),\"AE56-60\",\"AE61+\"))))","v":""},"leer ",{"$f":"IF(N112=\"ja\",IF(AND(M112>24.999%,M112<50.001%),'Hilfstab Auswahl SOPÄ'!$J$5/2,IF(M112>50%,'Hilfstab Auswahl SOPÄ'!$J$5,0)),0)","v":{"v":0,"d":"0.000%"}}]
["Auswählen","Auswählen",{"$nulls":5},"Auswählen",null,"Auswählen","Auswählen",{"$nulls":3},"Auswählen","Auswählen",{"$f":"VLOOKUP(O113&P113,CHOOSE({1,2},'Hilfstab Löhne'!$A$3:$A$187&'Hilfstab Löhne'!$B$3:$B$187,'Hilfstab Löhne'!$D$3:$D$187),2,0)","v":0},0,{"v":0,"d":"0.000%"},{"$f":"ROUND(IF(S113=0,0,IF(OR(S113='Hilfstab Auswahl SOPÄ'!$L$6,S113='Hilfstab Auswahl SOPÄ'!$L$8),IF(M113>1,'Hilfstab Auswahl SOPÄ'!$M$6,'Hilfstab Auswahl SOPÄ'!$M$6*M113),IF(OR(S113='Hilfstab Auswahl SOPÄ'!$L$7,S113='Hilfstab Auswahl SOPÄ'!$L$9),IF(M113>1,'Hilfstab Auswahl SOPÄ'!$M$7,'Hilfstab Auswahl SOPÄ'!$M$7*M113),IF(S113='Hilfstab Auswahl SOPÄ'!$L$10,IF(M113>1,'Hilfstab Auswahl SOPÄ'!$M$10,'Hilfstab Auswahl SOPÄ'!$M$10*M113),IF(M113>1,'Hilfstab Auswahl SOPÄ'!$M$11,'Hilfstab Auswahl SOPÄ'!$M$11*M113))))),5)+AE113","v":{"v":0,"d":"0.000%"}},{"$f":"IF(V113=\"ja\",\"ja\",IF(O113=0,0,IF(OR(O113='Hilfstab Auswahl SOPÄ'!$C$7,O113='Hilfstab Auswahl SOPÄ'!$C$6,O113='Hilfstab Auswahl SOPÄ'!$C$13),\"ja\",\"nein\")))","v":"nein"},null,null,{"$f":"IF(OR(O113='Hilfstab Auswahl SOPÄ'!$C$11,O113='Hilfstab Auswahl SOPÄ'!$C$12)*AND(P113>1),\"* genehmigungspflichtige LK\",0)","v":0},null,"",0,{"$f":"VLOOKUP($A113,'Hilfstab Auswahl SOPÄ'!$G$6:$H$9,2,FALSE)","v":"leer"},{"$f":"IF(E113=0,\"\",IF(I113=0,\"Jahrgang fehlt\",IF(YEAR(I113)>'Hilfstab AE'!$B$16,0,IF(AND(YEAR(I113)<('Hilfstab AE'!$B$16+1),YEAR(I113)>('Hilfstab AE'!$D$16-1)),\"AE56-60\",\"AE61+\"))))","v":""},"leer ",{"$f":"IF(N113=\"ja\",IF(AND(M113>24.999%,M113<50.001%),'Hilfstab Auswahl SOPÄ'!$J$5/2,IF(M113>50%,'Hilfstab Auswahl SOPÄ'!$J$5,0)),0)","v":{"v":0,"d":"0.000%"}}]
["Auswählen","Auswählen",{"$nulls":5},"Auswählen",null,"Auswählen","Auswählen",{"$nulls":3},"Auswählen","Auswählen",{"$f":"VLOOKUP(O114&P114,CHOOSE({1,2},'Hilfstab Löhne'!$A$3:$A$187&'Hilfstab Löhne'!$B$3:$B$187,'Hilfstab Löhne'!$D$3:$D$187),2,0)","v":0},0,{"v":0,"d":"0.000%"},{"$f":"ROUND(IF(S114=0,0,IF(OR(S114='Hilfstab Auswahl SOPÄ'!$L$6,S114='Hilfstab Auswahl SOPÄ'!$L$8),IF(M114>1,'Hilfstab Auswahl SOPÄ'!$M$6,'Hilfstab Auswahl SOPÄ'!$M$6*M114),IF(OR(S114='Hilfstab Auswahl SOPÄ'!$L$7,S114='Hilfstab Auswahl SOPÄ'!$L$9),IF(M114>1,'Hilfstab Auswahl SOPÄ'!$M$7,'Hilfstab Auswahl SOPÄ'!$M$7*M114),IF(S114='Hilfstab Auswahl SOPÄ'!$L$10,IF(M114>1,'Hilfstab Auswahl SOPÄ'!$M$10,'Hilfstab Auswahl SOPÄ'!$M$10*M114),IF(M114>1,'Hilfstab Auswahl SOPÄ'!$M$11,'Hilfstab Auswahl SOPÄ'!$M$11*M114))))),5)+AE114","v":{"v":0,"d":"0.000%"}},{"$f":"IF(V114=\"ja\",\"ja\",IF(O114=0,0,IF(OR(O114='Hilfstab Auswahl SOPÄ'!$C$7,O114='Hilfstab Auswahl SOPÄ'!$C$6,O114='Hilfstab Auswahl SOPÄ'!$C$13),\"ja\",\"nein\")))","v":"nein"},null,null,{"$f":"IF(OR(O114='Hilfstab Auswahl SOPÄ'!$C$11,O114='Hilfstab Auswahl SOPÄ'!$C$12)*AND(P114>1),\"* genehmigungspflichtige LK\",0)","v":0},null,"",0,{"$f":"VLOOKUP($A114,'Hilfstab Auswahl SOPÄ'!$G$6:$H$9,2,FALSE)","v":"leer"},{"$f":"IF(E114=0,\"\",IF(I114=0,\"Jahrgang fehlt\",IF(YEAR(I114)>'Hilfstab AE'!$B$16,0,IF(AND(YEAR(I114)<('Hilfstab AE'!$B$16+1),YEAR(I114)>('Hilfstab AE'!$D$16-1)),\"AE56-60\",\"AE61+\"))))","v":""},"leer ",{"$f":"IF(N114=\"ja\",IF(AND(M114>24.999%,M114<50.001%),'Hilfstab Auswahl SOPÄ'!$J$5/2,IF(M114>50%,'Hilfstab Auswahl SOPÄ'!$J$5,0)),0)","v":{"v":0,"d":"0.000%"}}]
["Auswählen","Auswählen",{"$nulls":5},"Auswählen",null,"Auswählen","Auswählen",{"$nulls":3},"Auswählen","Auswählen",{"$f":"VLOOKUP(O115&P115,CHOOSE({1,2},'Hilfstab Löhne'!$A$3:$A$187&'Hilfstab Löhne'!$B$3:$B$187,'Hilfstab Löhne'!$D$3:$D$187),2,0)","v":0},0,{"v":0,"d":"0.000%"},{"$f":"ROUND(IF(S115=0,0,IF(OR(S115='Hilfstab Auswahl SOPÄ'!$L$6,S115='Hilfstab Auswahl SOPÄ'!$L$8),IF(M115>1,'Hilfstab Auswahl SOPÄ'!$M$6,'Hilfstab Auswahl SOPÄ'!$M$6*M115),IF(OR(S115='Hilfstab Auswahl SOPÄ'!$L$7,S115='Hilfstab Auswahl SOPÄ'!$L$9),IF(M115>1,'Hilfstab Auswahl SOPÄ'!$M$7,'Hilfstab Auswahl SOPÄ'!$M$7*M115),IF(S115='Hilfstab Auswahl SOPÄ'!$L$10,IF(M115>1,'Hilfstab Auswahl SOPÄ'!$M$10,'Hilfstab Auswahl SOPÄ'!$M$10*M115),IF(M115>1,'Hilfstab Auswahl SOPÄ'!$M$11,'Hilfstab Auswahl SOPÄ'!$M$11*M115))))),5)+AE115","v":{"v":0,"d":"0.000%"}},{"$f":"IF(V115=\"ja\",\"ja\",IF(O115=0,0,IF(OR(O115='Hilfstab Auswahl SOPÄ'!$C$7,O115='Hilfstab Auswahl SOPÄ'!$C$6,O115='Hilfstab Auswahl SOPÄ'!$C$13),\"ja\",\"nein\")))","v":"nein"},null,null,{"$f":"IF(OR(O115='Hilfstab Auswahl SOPÄ'!$C$11,O115='Hilfstab Auswahl SOPÄ'!$C$12)*AND(P115>1),\"* genehmigungspflichtige LK\",0)","v":0},null,"",0,{"$f":"VLOOKUP($A115,'Hilfstab Auswahl SOPÄ'!$G$6:$H$9,2,FALSE)","v":"leer"},{"$f":"IF(E115=0,\"\",IF(I115=0,\"Jahrgang fehlt\",IF(YEAR(I115)>'Hilfstab AE'!$B$16,0,IF(AND(YEAR(I115)<('Hilfstab AE'!$B$16+1),YEAR(I115)>('Hilfstab AE'!$D$16-1)),\"AE56-60\",\"AE61+\"))))","v":""},"leer ",{"$f":"IF(N115=\"ja\",IF(AND(M115>24.999%,M115<50.001%),'Hilfstab Auswahl SOPÄ'!$J$5/2,IF(M115>50%,'Hilfstab Auswahl SOPÄ'!$J$5,0)),0)","v":{"v":0,"d":"0.000%"}}]
["Auswählen","Auswählen",{"$nulls":5},"Auswählen",null,"Auswählen","Auswählen",{"$nulls":3},"Auswählen","Auswählen",{"$f":"VLOOKUP(O116&P116,CHOOSE({1,2},'Hilfstab Löhne'!$A$3:$A$187&'Hilfstab Löhne'!$B$3:$B$187,'Hilfstab Löhne'!$D$3:$D$187),2,0)","v":0},0,{"v":0,"d":"0.000%"},{"$f":"ROUND(IF(S116=0,0,IF(OR(S116='Hilfstab Auswahl SOPÄ'!$L$6,S116='Hilfstab Auswahl SOPÄ'!$L$8),IF(M116>1,'Hilfstab Auswahl SOPÄ'!$M$6,'Hilfstab Auswahl SOPÄ'!$M$6*M116),IF(OR(S116='Hilfstab Auswahl SOPÄ'!$L$7,S116='Hilfstab Auswahl SOPÄ'!$L$9),IF(M116>1,'Hilfstab Auswahl SOPÄ'!$M$7,'Hilfstab Auswahl SOPÄ'!$M$7*M116),IF(S116='Hilfstab Auswahl SOPÄ'!$L$10,IF(M116>1,'Hilfstab Auswahl SOPÄ'!$M$10,'Hilfstab Auswahl SOPÄ'!$M$10*M116),IF(M116>1,'Hilfstab Auswahl SOPÄ'!$M$11,'Hilfstab Auswahl SOPÄ'!$M$11*M116))))),5)+AE116","v":{"v":0,"d":"0.000%"}},{"$f":"IF(V116=\"ja\",\"ja\",IF(O116=0,0,IF(OR(O116='Hilfstab Auswahl SOPÄ'!$C$7,O116='Hilfstab Auswahl SOPÄ'!$C$6,O116='Hilfstab Auswahl SOPÄ'!$C$13),\"ja\",\"nein\")))","v":"nein"},null,null,{"$f":"IF(OR(O116='Hilfstab Auswahl SOPÄ'!$C$11,O116='Hilfstab Auswahl SOPÄ'!$C$12)*AND(P116>1),\"* genehmigungspflichtige LK\",0)","v":0},null,"",0,{"$f":"VLOOKUP($A116,'Hilfstab Auswahl SOPÄ'!$G$6:$H$9,2,FALSE)","v":"leer"},{"$f":"IF(E116=0,\"\",IF(I116=0,\"Jahrgang fehlt\",IF(YEAR(I116)>'Hilfstab AE'!$B$16,0,IF(AND(YEAR(I116)<('Hilfstab AE'!$B$16+1),YEAR(I116)>('Hilfstab AE'!$D$16-1)),\"AE56-60\",\"AE61+\"))))","v":""},"leer ",{"$f":"IF(N116=\"ja\",IF(AND(M116>24.999%,M116<50.001%),'Hilfstab Auswahl SOPÄ'!$J$5/2,IF(M116>50%,'Hilfstab Auswahl SOPÄ'!$J$5,0)),0)","v":{"v":0,"d":"0.000%"}}]
["Auswählen","Auswählen",{"$nulls":5},"Auswählen",null,"Auswählen","Auswählen",{"$nulls":3},"Auswählen","Auswählen",{"$f":"VLOOKUP(O117&P117,CHOOSE({1,2},'Hilfstab Löhne'!$A$3:$A$187&'Hilfstab Löhne'!$B$3:$B$187,'Hilfstab Löhne'!$D$3:$D$187),2,0)","v":0},0,{"v":0,"d":"0.000%"},{"$f":"ROUND(IF(S117=0,0,IF(OR(S117='Hilfstab Auswahl SOPÄ'!$L$6,S117='Hilfstab Auswahl SOPÄ'!$L$8),IF(M117>1,'Hilfstab Auswahl SOPÄ'!$M$6,'Hilfstab Auswahl SOPÄ'!$M$6*M117),IF(OR(S117='Hilfstab Auswahl SOPÄ'!$L$7,S117='Hilfstab Auswahl SOPÄ'!$L$9),IF(M117>1,'Hilfstab Auswahl SOPÄ'!$M$7,'Hilfstab Auswahl SOPÄ'!$M$7*M117),IF(S117='Hilfstab Auswahl SOPÄ'!$L$10,IF(M117>1,'Hilfstab Auswahl SOPÄ'!$M$10,'Hilfstab Auswahl SOPÄ'!$M$10*M117),IF(M117>1,'Hilfstab Auswahl SOPÄ'!$M$11,'Hilfstab Auswahl SOPÄ'!$M$11*M117))))),5)+AE117","v":{"v":0,"d":"0.000%"}},{"$f":"IF(V117=\"ja\",\"ja\",IF(O117=0,0,IF(OR(O117='Hilfstab Auswahl SOPÄ'!$C$7,O117='Hilfstab Auswahl SOPÄ'!$C$6,O117='Hilfstab Auswahl SOPÄ'!$C$13),\"ja\",\"nein\")))","v":"nein"},null,null,{"$f":"IF(OR(O117='Hilfstab Auswahl SOPÄ'!$C$11,O117='Hilfstab Auswahl SOPÄ'!$C$12)*AND(P117>1),\"* genehmigungspflichtige LK\",0)","v":0},null,"",0,{"$f":"VLOOKUP($A117,'Hilfstab Auswahl SOPÄ'!$G$6:$H$9,2,FALSE)","v":"leer"},{"$f":"IF(E117=0,\"\",IF(I117=0,\"Jahrgang fehlt\",IF(YEAR(I117)>'Hilfstab AE'!$B$16,0,IF(AND(YEAR(I117)<('Hilfstab AE'!$B$16+1),YEAR(I117)>('Hilfstab AE'!$D$16-1)),\"AE56-60\",\"AE61+\"))))","v":""},"leer ",{"$f":"IF(N117=\"ja\",IF(AND(M117>24.999%,M117<50.001%),'Hilfstab Auswahl SOPÄ'!$J$5/2,IF(M117>50%,'Hilfstab Auswahl SOPÄ'!$J$5,0)),0)","v":{"v":0,"d":"0.000%"}}]
["Auswählen","Auswählen",{"$nulls":5},"Auswählen",null,"Auswählen","Auswählen",{"$nulls":3},"Auswählen","Auswählen",{"$f":"VLOOKUP(O118&P118,CHOOSE({1,2},'Hilfstab Löhne'!$A$3:$A$187&'Hilfstab Löhne'!$B$3:$B$187,'Hilfstab Löhne'!$D$3:$D$187),2,0)","v":0},0,{"v":0,"d":"0.000%"},{"$f":"ROUND(IF(S118=0,0,IF(OR(S118='Hilfstab Auswahl SOPÄ'!$L$6,S118='Hilfstab Auswahl SOPÄ'!$L$8),IF(M118>1,'Hilfstab Auswahl SOPÄ'!$M$6,'Hilfstab Auswahl SOPÄ'!$M$6*M118),IF(OR(S118='Hilfstab Auswahl SOPÄ'!$L$7,S118='Hilfstab Auswahl SOPÄ'!$L$9),IF(M118>1,'Hilfstab Auswahl SOPÄ'!$M$7,'Hilfstab Auswahl SOPÄ'!$M$7*M118),IF(S118='Hilfstab Auswahl SOPÄ'!$L$10,IF(M118>1,'Hilfstab Auswahl SOPÄ'!$M$10,'Hilfstab Auswahl SOPÄ'!$M$10*M118),IF(M118>1,'Hilfstab Auswahl SOPÄ'!$M$11,'Hilfstab Auswahl SOPÄ'!$M$11*M118))))),5)+AE118","v":{"v":0,"d":"0.000%"}},{"$f":"IF(V118=\"ja\",\"ja\",IF(O118=0,0,IF(OR(O118='Hilfstab Auswahl SOPÄ'!$C$7,O118='Hilfstab Auswahl SOPÄ'!$C$6,O118='Hilfstab Auswahl SOPÄ'!$C$13),\"ja\",\"nein\")))","v":"nein"},null,null,{"$f":"IF(OR(O118='Hilfstab Auswahl SOPÄ'!$C$11,O118='Hilfstab Auswahl SOPÄ'!$C$12)*AND(P118>1),\"* genehmigungspflichtige LK\",0)","v":0},null,"",0,{"$f":"VLOOKUP($A118,'Hilfstab Auswahl SOPÄ'!$G$6:$H$9,2,FALSE)","v":"leer"},{"$f":"IF(E118=0,\"\",IF(I118=0,\"Jahrgang fehlt\",IF(YEAR(I118)>'Hilfstab AE'!$B$16,0,IF(AND(YEAR(I118)<('Hilfstab AE'!$B$16+1),YEAR(I118)>('Hilfstab AE'!$D$16-1)),\"AE56-60\",\"AE61+\"))))","v":""},"leer ",{"$f":"IF(N118=\"ja\",IF(AND(M118>24.999%,M118<50.001%),'Hilfstab Auswahl SOPÄ'!$J$5/2,IF(M118>50%,'Hilfstab Auswahl SOPÄ'!$J$5,0)),0)","v":{"v":0,"d":"0.000%"}}]
["Auswählen","Auswählen",{"$nulls":5},"Auswählen",null,"Auswählen","Auswählen",{"$nulls":3},"Auswählen","Auswählen",{"$f":"VLOOKUP(O119&P119,CHOOSE({1,2},'Hilfstab Löhne'!$A$3:$A$187&'Hilfstab Löhne'!$B$3:$B$187,'Hilfstab Löhne'!$D$3:$D$187),2,0)","v":0},0,{"v":0,"d":"0.000%"},{"$f":"ROUND(IF(S119=0,0,IF(OR(S119='Hilfstab Auswahl SOPÄ'!$L$6,S119='Hilfstab Auswahl SOPÄ'!$L$8),IF(M119>1,'Hilfstab Auswahl SOPÄ'!$M$6,'Hilfstab Auswahl SOPÄ'!$M$6*M119),IF(OR(S119='Hilfstab Auswahl SOPÄ'!$L$7,S119='Hilfstab Auswahl SOPÄ'!$L$9),IF(M119>1,'Hilfstab Auswahl SOPÄ'!$M$7,'Hilfstab Auswahl SOPÄ'!$M$7*M119),IF(S119='Hilfstab Auswahl SOPÄ'!$L$10,IF(M119>1,'Hilfstab Auswahl SOPÄ'!$M$10,'Hilfstab Auswahl SOPÄ'!$M$10*M119),IF(M119>1,'Hilfstab Auswahl SOPÄ'!$M$11,'Hilfstab Auswahl SOPÄ'!$M$11*M119))))),5)+AE119","v":{"v":0,"d":"0.000%"}},{"$f":"IF(V119=\"ja\",\"ja\",IF(O119=0,0,IF(OR(O119='Hilfstab Auswahl SOPÄ'!$C$7,O119='Hilfstab Auswahl SOPÄ'!$C$6,O119='Hilfstab Auswahl SOPÄ'!$C$13),\"ja\",\"nein\")))","v":"nein"},null,null,{"$f":"IF(OR(O119='Hilfstab Auswahl SOPÄ'!$C$11,O119='Hilfstab Auswahl SOPÄ'!$C$12)*AND(P119>1),\"* genehmigungspflichtige LK\",0)","v":0},null,"",0,{"$f":"VLOOKUP($A119,'Hilfstab Auswahl SOPÄ'!$G$6:$H$9,2,FALSE)","v":"leer"},{"$f":"IF(E119=0,\"\",IF(I119=0,\"Jahrgang fehlt\",IF(YEAR(I119)>'Hilfstab AE'!$B$16,0,IF(AND(YEAR(I119)<('Hilfstab AE'!$B$16+1),YEAR(I119)>('Hilfstab AE'!$D$16-1)),\"AE56-60\",\"AE61+\"))))","v":""},"leer ",{"$f":"IF(N119=\"ja\",IF(AND(M119>24.999%,M119<50.001%),'Hilfstab Auswahl SOPÄ'!$J$5/2,IF(M119>50%,'Hilfstab Auswahl SOPÄ'!$J$5,0)),0)","v":{"v":0,"d":"0.000%"}}]
["Auswählen","Auswählen",{"$nulls":5},"Auswählen",null,"Auswählen","Auswählen",{"$nulls":3},"Auswählen","Auswählen",{"$f":"VLOOKUP(O120&P120,CHOOSE({1,2},'Hilfstab Löhne'!$A$3:$A$187&'Hilfstab Löhne'!$B$3:$B$187,'Hilfstab Löhne'!$D$3:$D$187),2,0)","v":0},0,{"v":0,"d":"0.000%"},{"$f":"ROUND(IF(S120=0,0,IF(OR(S120='Hilfstab Auswahl SOPÄ'!$L$6,S120='Hilfstab Auswahl SOPÄ'!$L$8),IF(M120>1,'Hilfstab Auswahl SOPÄ'!$M$6,'Hilfstab Auswahl SOPÄ'!$M$6*M120),IF(OR(S120='Hilfstab Auswahl SOPÄ'!$L$7,S120='Hilfstab Auswahl SOPÄ'!$L$9),IF(M120>1,'Hilfstab Auswahl SOPÄ'!$M$7,'Hilfstab Auswahl SOPÄ'!$M$7*M120),IF(S120='Hilfstab Auswahl SOPÄ'!$L$10,IF(M120>1,'Hilfstab Auswahl SOPÄ'!$M$10,'Hilfstab Auswahl SOPÄ'!$M$10*M120),IF(M120>1,'Hilfstab Auswahl SOPÄ'!$M$11,'Hilfstab Auswahl SOPÄ'!$M$11*M120))))),5)+AE120","v":{"v":0,"d":"0.000%"}},{"$f":"IF(V120=\"ja\",\"ja\",IF(O120=0,0,IF(OR(O120='Hilfstab Auswahl SOPÄ'!$C$7,O120='Hilfstab Auswahl SOPÄ'!$C$6,O120='Hilfstab Auswahl SOPÄ'!$C$13),\"ja\",\"nein\")))","v":"nein"},null,null,{"$f":"IF(OR(O120='Hilfstab Auswahl SOPÄ'!$C$11,O120='Hilfstab Auswahl SOPÄ'!$C$12)*AND(P120>1),\"* genehmigungspflichtige LK\",0)","v":0},null,"",0,{"$f":"VLOOKUP($A120,'Hilfstab Auswahl SOPÄ'!$G$6:$H$9,2,FALSE)","v":"leer"},{"$f":"IF(E120=0,\"\",IF(I120=0,\"Jahrgang fehlt\",IF(YEAR(I120)>'Hilfstab AE'!$B$16,0,IF(AND(YEAR(I120)<('Hilfstab AE'!$B$16+1),YEAR(I120)>('Hilfstab AE'!$D$16-1)),\"AE56-60\",\"AE61+\"))))","v":""},"leer ",{"$f":"IF(N120=\"ja\",IF(AND(M120>24.999%,M120<50.001%),'Hilfstab Auswahl SOPÄ'!$J$5/2,IF(M120>50%,'Hilfstab Auswahl SOPÄ'!$J$5,0)),0)","v":{"v":0,"d":"0.000%"}}]
["Auswählen","Auswählen",{"$nulls":5},"Auswählen",null,"Auswählen","Auswählen",{"$nulls":3},"Auswählen","Auswählen",{"$f":"VLOOKUP(O121&P121,CHOOSE({1,2},'Hilfstab Löhne'!$A$3:$A$187&'Hilfstab Löhne'!$B$3:$B$187,'Hilfstab Löhne'!$D$3:$D$187),2,0)","v":0},0,{"v":0,"d":"0.000%"},{"$f":"ROUND(IF(S121=0,0,IF(OR(S121='Hilfstab Auswahl SOPÄ'!$L$6,S121='Hilfstab Auswahl SOPÄ'!$L$8),IF(M121>1,'Hilfstab Auswahl SOPÄ'!$M$6,'Hilfstab Auswahl SOPÄ'!$M$6*M121),IF(OR(S121='Hilfstab Auswahl SOPÄ'!$L$7,S121='Hilfstab Auswahl SOPÄ'!$L$9),IF(M121>1,'Hilfstab Auswahl SOPÄ'!$M$7,'Hilfstab Auswahl SOPÄ'!$M$7*M121),IF(S121='Hilfstab Auswahl SOPÄ'!$L$10,IF(M121>1,'Hilfstab Auswahl SOPÄ'!$M$10,'Hilfstab Auswahl SOPÄ'!$M$10*M121),IF(M121>1,'Hilfstab Auswahl SOPÄ'!$M$11,'Hilfstab Auswahl SOPÄ'!$M$11*M121))))),5)+AE121","v":{"v":0,"d":"0.000%"}},{"$f":"IF(V121=\"ja\",\"ja\",IF(O121=0,0,IF(OR(O121='Hilfstab Auswahl SOPÄ'!$C$7,O121='Hilfstab Auswahl SOPÄ'!$C$6,O121='Hilfstab Auswahl SOPÄ'!$C$13),\"ja\",\"nein\")))","v":"nein"},null,null,{"$f":"IF(OR(O121='Hilfstab Auswahl SOPÄ'!$C$11,O121='Hilfstab Auswahl SOPÄ'!$C$12)*AND(P121>1),\"* genehmigungspflichtige LK\",0)","v":0},null,"",0,{"$f":"VLOOKUP($A121,'Hilfstab Auswahl SOPÄ'!$G$6:$H$9,2,FALSE)","v":"leer"},{"$f":"IF(E121=0,\"\",IF(I121=0,\"Jahrgang fehlt\",IF(YEAR(I121)>'Hilfstab AE'!$B$16,0,IF(AND(YEAR(I121)<('Hilfstab AE'!$B$16+1),YEAR(I121)>('Hilfstab AE'!$D$16-1)),\"AE56-60\",\"AE61+\"))))","v":""},"leer ",{"$f":"IF(N121=\"ja\",IF(AND(M121>24.999%,M121<50.001%),'Hilfstab Auswahl SOPÄ'!$J$5/2,IF(M121>50%,'Hilfstab Auswahl SOPÄ'!$J$5,0)),0)","v":{"v":0,"d":"0.000%"}}]
["Auswählen","Auswählen",{"$nulls":5},"Auswählen",null,"Auswählen","Auswählen",{"$nulls":3},"Auswählen","Auswählen",{"$f":"VLOOKUP(O122&P122,CHOOSE({1,2},'Hilfstab Löhne'!$A$3:$A$187&'Hilfstab Löhne'!$B$3:$B$187,'Hilfstab Löhne'!$D$3:$D$187),2,0)","v":0},0,{"v":0,"d":"0.000%"},{"$f":"ROUND(IF(S122=0,0,IF(OR(S122='Hilfstab Auswahl SOPÄ'!$L$6,S122='Hilfstab Auswahl SOPÄ'!$L$8),IF(M122>1,'Hilfstab Auswahl SOPÄ'!$M$6,'Hilfstab Auswahl SOPÄ'!$M$6*M122),IF(OR(S122='Hilfstab Auswahl SOPÄ'!$L$7,S122='Hilfstab Auswahl SOPÄ'!$L$9),IF(M122>1,'Hilfstab Auswahl SOPÄ'!$M$7,'Hilfstab Auswahl SOPÄ'!$M$7*M122),IF(S122='Hilfstab Auswahl SOPÄ'!$L$10,IF(M122>1,'Hilfstab Auswahl SOPÄ'!$M$10,'Hilfstab Auswahl SOPÄ'!$M$10*M122),IF(M122>1,'Hilfstab Auswahl SOPÄ'!$M$11,'Hilfstab Auswahl SOPÄ'!$M$11*M122))))),5)+AE122","v":{"v":0,"d":"0.000%"}},{"$f":"IF(V122=\"ja\",\"ja\",IF(O122=0,0,IF(OR(O122='Hilfstab Auswahl SOPÄ'!$C$7,O122='Hilfstab Auswahl SOPÄ'!$C$6,O122='Hilfstab Auswahl SOPÄ'!$C$13),\"ja\",\"nein\")))","v":"nein"},null,null,{"$f":"IF(OR(O122='Hilfstab Auswahl SOPÄ'!$C$11,O122='Hilfstab Auswahl SOPÄ'!$C$12)*AND(P122>1),\"* genehmigungspflichtige LK\",0)","v":0},null,"",0,{"$f":"VLOOKUP($A122,'Hilfstab Auswahl SOPÄ'!$G$6:$H$9,2,FALSE)","v":"leer"},{"$f":"IF(E122=0,\"\",IF(I122=0,\"Jahrgang fehlt\",IF(YEAR(I122)>'Hilfstab AE'!$B$16,0,IF(AND(YEAR(I122)<('Hilfstab AE'!$B$16+1),YEAR(I122)>('Hilfstab AE'!$D$16-1)),\"AE56-60\",\"AE61+\"))))","v":""},"leer ",{"$f":"IF(N122=\"ja\",IF(AND(M122>24.999%,M122<50.001%),'Hilfstab Auswahl SOPÄ'!$J$5/2,IF(M122>50%,'Hilfstab Auswahl SOPÄ'!$J$5,0)),0)","v":{"v":0,"d":"0.000%"}}]
["Auswählen","Auswählen",{"$nulls":5},"Auswählen",null,"Auswählen","Auswählen",{"$nulls":3},"Auswählen","Auswählen",{"$f":"VLOOKUP(O123&P123,CHOOSE({1,2},'Hilfstab Löhne'!$A$3:$A$187&'Hilfstab Löhne'!$B$3:$B$187,'Hilfstab Löhne'!$D$3:$D$187),2,0)","v":0},0,{"v":0,"d":"0.000%"},{"$f":"ROUND(IF(S123=0,0,IF(OR(S123='Hilfstab Auswahl SOPÄ'!$L$6,S123='Hilfstab Auswahl SOPÄ'!$L$8),IF(M123>1,'Hilfstab Auswahl SOPÄ'!$M$6,'Hilfstab Auswahl SOPÄ'!$M$6*M123),IF(OR(S123='Hilfstab Auswahl SOPÄ'!$L$7,S123='Hilfstab Auswahl SOPÄ'!$L$9),IF(M123>1,'Hilfstab Auswahl SOPÄ'!$M$7,'Hilfstab Auswahl SOPÄ'!$M$7*M123),IF(S123='Hilfstab Auswahl SOPÄ'!$L$10,IF(M123>1,'Hilfstab Auswahl SOPÄ'!$M$10,'Hilfstab Auswahl SOPÄ'!$M$10*M123),IF(M123>1,'Hilfstab Auswahl SOPÄ'!$M$11,'Hilfstab Auswahl SOPÄ'!$M$11*M123))))),5)+AE123","v":{"v":0,"d":"0.000%"}},{"$f":"IF(V123=\"ja\",\"ja\",IF(O123=0,0,IF(OR(O123='Hilfstab Auswahl SOPÄ'!$C$7,O123='Hilfstab Auswahl SOPÄ'!$C$6,O123='Hilfstab Auswahl SOPÄ'!$C$13),\"ja\",\"nein\")))","v":"nein"},null,null,{"$f":"IF(OR(O123='Hilfstab Auswahl SOPÄ'!$C$11,O123='Hilfstab Auswahl SOPÄ'!$C$12)*AND(P123>1),\"* genehmigungspflichtige LK\",0)","v":0},null,"",0,{"$f":"VLOOKUP($A123,'Hilfstab Auswahl SOPÄ'!$G$6:$H$9,2,FALSE)","v":"leer"},{"$f":"IF(E123=0,\"\",IF(I123=0,\"Jahrgang fehlt\",IF(YEAR(I123)>'Hilfstab AE'!$B$16,0,IF(AND(YEAR(I123)<('Hilfstab AE'!$B$16+1),YEAR(I123)>('Hilfstab AE'!$D$16-1)),\"AE56-60\",\"AE61+\"))))","v":""},"leer ",{"$f":"IF(N123=\"ja\",IF(AND(M123>24.999%,M123<50.001%),'Hilfstab Auswahl SOPÄ'!$J$5/2,IF(M123>50%,'Hilfstab Auswahl SOPÄ'!$J$5,0)),0)","v":{"v":0,"d":"0.000%"}}]
["Auswählen","Auswählen",{"$nulls":5},"Auswählen",null,"Auswählen","Auswählen",{"$nulls":3},"Auswählen","Auswählen",{"$f":"VLOOKUP(O124&P124,CHOOSE({1,2},'Hilfstab Löhne'!$A$3:$A$187&'Hilfstab Löhne'!$B$3:$B$187,'Hilfstab Löhne'!$D$3:$D$187),2,0)","v":0},0,{"v":0,"d":"0.000%"},{"$f":"ROUND(IF(S124=0,0,IF(OR(S124='Hilfstab Auswahl SOPÄ'!$L$6,S124='Hilfstab Auswahl SOPÄ'!$L$8),IF(M124>1,'Hilfstab Auswahl SOPÄ'!$M$6,'Hilfstab Auswahl SOPÄ'!$M$6*M124),IF(OR(S124='Hilfstab Auswahl SOPÄ'!$L$7,S124='Hilfstab Auswahl SOPÄ'!$L$9),IF(M124>1,'Hilfstab Auswahl SOPÄ'!$M$7,'Hilfstab Auswahl SOPÄ'!$M$7*M124),IF(S124='Hilfstab Auswahl SOPÄ'!$L$10,IF(M124>1,'Hilfstab Auswahl SOPÄ'!$M$10,'Hilfstab Auswahl SOPÄ'!$M$10*M124),IF(M124>1,'Hilfstab Auswahl SOPÄ'!$M$11,'Hilfstab Auswahl SOPÄ'!$M$11*M124))))),5)+AE124","v":{"v":0,"d":"0.000%"}},{"$f":"IF(V124=\"ja\",\"ja\",IF(O124=0,0,IF(OR(O124='Hilfstab Auswahl SOPÄ'!$C$7,O124='Hilfstab Auswahl SOPÄ'!$C$6,O124='Hilfstab Auswahl SOPÄ'!$C$13),\"ja\",\"nein\")))","v":"nein"},null,null,{"$f":"IF(OR(O124='Hilfstab Auswahl SOPÄ'!$C$11,O124='Hilfstab Auswahl SOPÄ'!$C$12)*AND(P124>1),\"* genehmigungspflichtige LK\",0)","v":0},null,"",0,{"$f":"VLOOKUP($A124,'Hilfstab Auswahl SOPÄ'!$G$6:$H$9,2,FALSE)","v":"leer"},{"$f":"IF(E124=0,\"\",IF(I124=0,\"Jahrgang fehlt\",IF(YEAR(I124)>'Hilfstab AE'!$B$16,0,IF(AND(YEAR(I124)<('Hilfstab AE'!$B$16+1),YEAR(I124)>('Hilfstab AE'!$D$16-1)),\"AE56-60\",\"AE61+\"))))","v":""},"leer ",{"$f":"IF(N124=\"ja\",IF(AND(M124>24.999%,M124<50.001%),'Hilfstab Auswahl SOPÄ'!$J$5/2,IF(M124>50%,'Hilfstab Auswahl SOPÄ'!$J$5,0)),0)","v":{"v":0,"d":"0.000%"}}]
["Auswählen","Auswählen",{"$nulls":5},"Auswählen",null,"Auswählen","Auswählen",{"$nulls":3},"Auswählen","Auswählen",{"$f":"VLOOKUP(O125&P125,CHOOSE({1,2},'Hilfstab Löhne'!$A$3:$A$187&'Hilfstab Löhne'!$B$3:$B$187,'Hilfstab Löhne'!$D$3:$D$187),2,0)","v":0},0,{"v":0,"d":"0.000%"},{"$f":"ROUND(IF(S125=0,0,IF(OR(S125='Hilfstab Auswahl SOPÄ'!$L$6,S125='Hilfstab Auswahl SOPÄ'!$L$8),IF(M125>1,'Hilfstab Auswahl SOPÄ'!$M$6,'Hilfstab Auswahl SOPÄ'!$M$6*M125),IF(OR(S125='Hilfstab Auswahl SOPÄ'!$L$7,S125='Hilfstab Auswahl SOPÄ'!$L$9),IF(M125>1,'Hilfstab Auswahl SOPÄ'!$M$7,'Hilfstab Auswahl SOPÄ'!$M$7*M125),IF(S125='Hilfstab Auswahl SOPÄ'!$L$10,IF(M125>1,'Hilfstab Auswahl SOPÄ'!$M$10,'Hilfstab Auswahl SOPÄ'!$M$10*M125),IF(M125>1,'Hilfstab Auswahl SOPÄ'!$M$11,'Hilfstab Auswahl SOPÄ'!$M$11*M125))))),5)+AE125","v":{"v":0,"d":"0.000%"}},{"$f":"IF(V125=\"ja\",\"ja\",IF(O125=0,0,IF(OR(O125='Hilfstab Auswahl SOPÄ'!$C$7,O125='Hilfstab Auswahl SOPÄ'!$C$6,O125='Hilfstab Auswahl SOPÄ'!$C$13),\"ja\",\"nein\")))","v":"nein"},null,null,{"$f":"IF(OR(O125='Hilfstab Auswahl SOPÄ'!$C$11,O125='Hilfstab Auswahl SOPÄ'!$C$12)*AND(P125>1),\"* genehmigungspflichtige LK\",0)","v":0},null,"",0,{"$f":"VLOOKUP($A125,'Hilfstab Auswahl SOPÄ'!$G$6:$H$9,2,FALSE)","v":"leer"},{"$f":"IF(E125=0,\"\",IF(I125=0,\"Jahrgang fehlt\",IF(YEAR(I125)>'Hilfstab AE'!$B$16,0,IF(AND(YEAR(I125)<('Hilfstab AE'!$B$16+1),YEAR(I125)>('Hilfstab AE'!$D$16-1)),\"AE56-60\",\"AE61+\"))))","v":""},"leer ",{"$f":"IF(N125=\"ja\",IF(AND(M125>24.999%,M125<50.001%),'Hilfstab Auswahl SOPÄ'!$J$5/2,IF(M125>50%,'Hilfstab Auswahl SOPÄ'!$J$5,0)),0)","v":{"v":0,"d":"0.000%"}}]
["Auswählen","Auswählen",{"$nulls":5},"Auswählen",null,"Auswählen","Auswählen",{"$nulls":3},"Auswählen","Auswählen",{"$f":"VLOOKUP(O126&P126,CHOOSE({1,2},'Hilfstab Löhne'!$A$3:$A$187&'Hilfstab Löhne'!$B$3:$B$187,'Hilfstab Löhne'!$D$3:$D$187),2,0)","v":0},0,{"v":0,"d":"0.000%"},{"$f":"ROUND(IF(S126=0,0,IF(OR(S126='Hilfstab Auswahl SOPÄ'!$L$6,S126='Hilfstab Auswahl SOPÄ'!$L$8),IF(M126>1,'Hilfstab Auswahl SOPÄ'!$M$6,'Hilfstab Auswahl SOPÄ'!$M$6*M126),IF(OR(S126='Hilfstab Auswahl SOPÄ'!$L$7,S126='Hilfstab Auswahl SOPÄ'!$L$9),IF(M126>1,'Hilfstab Auswahl SOPÄ'!$M$7,'Hilfstab Auswahl SOPÄ'!$M$7*M126),IF(S126='Hilfstab Auswahl SOPÄ'!$L$10,IF(M126>1,'Hilfstab Auswahl SOPÄ'!$M$10,'Hilfstab Auswahl SOPÄ'!$M$10*M126),IF(M126>1,'Hilfstab Auswahl SOPÄ'!$M$11,'Hilfstab Auswahl SOPÄ'!$M$11*M126))))),5)+AE126","v":{"v":0,"d":"0.000%"}},{"$f":"IF(V126=\"ja\",\"ja\",IF(O126=0,0,IF(OR(O126='Hilfstab Auswahl SOPÄ'!$C$7,O126='Hilfstab Auswahl SOPÄ'!$C$6,O126='Hilfstab Auswahl SOPÄ'!$C$13),\"ja\",\"nein\")))","v":"nein"},null,null,{"$f":"IF(OR(O126='Hilfstab Auswahl SOPÄ'!$C$11,O126='Hilfstab Auswahl SOPÄ'!$C$12)*AND(P126>1),\"* genehmigungspflichtige LK\",0)","v":0},null,"",0,{"$f":"VLOOKUP($A126,'Hilfstab Auswahl SOPÄ'!$G$6:$H$9,2,FALSE)","v":"leer"},{"$f":"IF(E126=0,\"\",IF(I126=0,\"Jahrgang fehlt\",IF(YEAR(I126)>'Hilfstab AE'!$B$16,0,IF(AND(YEAR(I126)<('Hilfstab AE'!$B$16+1),YEAR(I126)>('Hilfstab AE'!$D$16-1)),\"AE56-60\",\"AE61+\"))))","v":""},"leer ",{"$f":"IF(N126=\"ja\",IF(AND(M126>24.999%,M126<50.001%),'Hilfstab Auswahl SOPÄ'!$J$5/2,IF(M126>50%,'Hilfstab Auswahl SOPÄ'!$J$5,0)),0)","v":{"v":0,"d":"0.000%"}}]
["Auswählen","Auswählen",{"$nulls":5},"Auswählen",null,"Auswählen","Auswählen",{"$nulls":3},"Auswählen","Auswählen",{"$f":"VLOOKUP(O127&P127,CHOOSE({1,2},'Hilfstab Löhne'!$A$3:$A$187&'Hilfstab Löhne'!$B$3:$B$187,'Hilfstab Löhne'!$D$3:$D$187),2,0)","v":0},0,{"v":0,"d":"0.000%"},{"$f":"ROUND(IF(S127=0,0,IF(OR(S127='Hilfstab Auswahl SOPÄ'!$L$6,S127='Hilfstab Auswahl SOPÄ'!$L$8),IF(M127>1,'Hilfstab Auswahl SOPÄ'!$M$6,'Hilfstab Auswahl SOPÄ'!$M$6*M127),IF(OR(S127='Hilfstab Auswahl SOPÄ'!$L$7,S127='Hilfstab Auswahl SOPÄ'!$L$9),IF(M127>1,'Hilfstab Auswahl SOPÄ'!$M$7,'Hilfstab Auswahl SOPÄ'!$M$7*M127),IF(S127='Hilfstab Auswahl SOPÄ'!$L$10,IF(M127>1,'Hilfstab Auswahl SOPÄ'!$M$10,'Hilfstab Auswahl SOPÄ'!$M$10*M127),IF(M127>1,'Hilfstab Auswahl SOPÄ'!$M$11,'Hilfstab Auswahl SOPÄ'!$M$11*M127))))),5)+AE127","v":{"v":0,"d":"0.000%"}},{"$f":"IF(V127=\"ja\",\"ja\",IF(O127=0,0,IF(OR(O127='Hilfstab Auswahl SOPÄ'!$C$7,O127='Hilfstab Auswahl SOPÄ'!$C$6,O127='Hilfstab Auswahl SOPÄ'!$C$13),\"ja\",\"nein\")))","v":"nein"},null,null,{"$f":"IF(OR(O127='Hilfstab Auswahl SOPÄ'!$C$11,O127='Hilfstab Auswahl SOPÄ'!$C$12)*AND(P127>1),\"* genehmigungspflichtige LK\",0)","v":0},null,"",0,{"$f":"VLOOKUP($A127,'Hilfstab Auswahl SOPÄ'!$G$6:$H$9,2,FALSE)","v":"leer"},{"$f":"IF(E127=0,\"\",IF(I127=0,\"Jahrgang fehlt\",IF(YEAR(I127)>'Hilfstab AE'!$B$16,0,IF(AND(YEAR(I127)<('Hilfstab AE'!$B$16+1),YEAR(I127)>('Hilfstab AE'!$D$16-1)),\"AE56-60\",\"AE61+\"))))","v":""},"leer ",{"$f":"IF(N127=\"ja\",IF(AND(M127>24.999%,M127<50.001%),'Hilfstab Auswahl SOPÄ'!$J$5/2,IF(M127>50%,'Hilfstab Auswahl SOPÄ'!$J$5,0)),0)","v":{"v":0,"d":"0.000%"}}]
["Auswählen","Auswählen",{"$nulls":5},"Auswählen",null,"Auswählen","Auswählen",{"$nulls":3},"Auswählen","Auswählen",{"$f":"VLOOKUP(O128&P128,CHOOSE({1,2},'Hilfstab Löhne'!$A$3:$A$187&'Hilfstab Löhne'!$B$3:$B$187,'Hilfstab Löhne'!$D$3:$D$187),2,0)","v":0},0,{"v":0,"d":"0.000%"},{"$f":"ROUND(IF(S128=0,0,IF(OR(S128='Hilfstab Auswahl SOPÄ'!$L$6,S128='Hilfstab Auswahl SOPÄ'!$L$8),IF(M128>1,'Hilfstab Auswahl SOPÄ'!$M$6,'Hilfstab Auswahl SOPÄ'!$M$6*M128),IF(OR(S128='Hilfstab Auswahl SOPÄ'!$L$7,S128='Hilfstab Auswahl SOPÄ'!$L$9),IF(M128>1,'Hilfstab Auswahl SOPÄ'!$M$7,'Hilfstab Auswahl SOPÄ'!$M$7*M128),IF(S128='Hilfstab Auswahl SOPÄ'!$L$10,IF(M128>1,'Hilfstab Auswahl SOPÄ'!$M$10,'Hilfstab Auswahl SOPÄ'!$M$10*M128),IF(M128>1,'Hilfstab Auswahl SOPÄ'!$M$11,'Hilfstab Auswahl SOPÄ'!$M$11*M128))))),5)+AE128","v":{"v":0,"d":"0.000%"}},{"$f":"IF(V128=\"ja\",\"ja\",IF(O128=0,0,IF(OR(O128='Hilfstab Auswahl SOPÄ'!$C$7,O128='Hilfstab Auswahl SOPÄ'!$C$6,O128='Hilfstab Auswahl SOPÄ'!$C$13),\"ja\",\"nein\")))","v":"nein"},null,null,{"$f":"IF(OR(O128='Hilfstab Auswahl SOPÄ'!$C$11,O128='Hilfstab Auswahl SOPÄ'!$C$12)*AND(P128>1),\"* genehmigungspflichtige LK\",0)","v":0},null,"",0,{"$f":"VLOOKUP($A128,'Hilfstab Auswahl SOPÄ'!$G$6:$H$9,2,FALSE)","v":"leer"},{"$f":"IF(E128=0,\"\",IF(I128=0,\"Jahrgang fehlt\",IF(YEAR(I128)>'Hilfstab AE'!$B$16,0,IF(AND(YEAR(I128)<('Hilfstab AE'!$B$16+1),YEAR(I128)>('Hilfstab AE'!$D$16-1)),\"AE56-60\",\"AE61+\"))))","v":""},"leer ",{"$f":"IF(N128=\"ja\",IF(AND(M128>24.999%,M128<50.001%),'Hilfstab Auswahl SOPÄ'!$J$5/2,IF(M128>50%,'Hilfstab Auswahl SOPÄ'!$J$5,0)),0)","v":{"v":0,"d":"0.000%"}}]
["Auswählen","Auswählen",{"$nulls":5},"Auswählen",null,"Auswählen","Auswählen",{"$nulls":3},"Auswählen","Auswählen",{"$f":"VLOOKUP(O129&P129,CHOOSE({1,2},'Hilfstab Löhne'!$A$3:$A$187&'Hilfstab Löhne'!$B$3:$B$187,'Hilfstab Löhne'!$D$3:$D$187),2,0)","v":0},0,{"v":0,"d":"0.000%"},{"$f":"ROUND(IF(S129=0,0,IF(OR(S129='Hilfstab Auswahl SOPÄ'!$L$6,S129='Hilfstab Auswahl SOPÄ'!$L$8),IF(M129>1,'Hilfstab Auswahl SOPÄ'!$M$6,'Hilfstab Auswahl SOPÄ'!$M$6*M129),IF(OR(S129='Hilfstab Auswahl SOPÄ'!$L$7,S129='Hilfstab Auswahl SOPÄ'!$L$9),IF(M129>1,'Hilfstab Auswahl SOPÄ'!$M$7,'Hilfstab Auswahl SOPÄ'!$M$7*M129),IF(S129='Hilfstab Auswahl SOPÄ'!$L$10,IF(M129>1,'Hilfstab Auswahl SOPÄ'!$M$10,'Hilfstab Auswahl SOPÄ'!$M$10*M129),IF(M129>1,'Hilfstab Auswahl SOPÄ'!$M$11,'Hilfstab Auswahl SOPÄ'!$M$11*M129))))),5)+AE129","v":{"v":0,"d":"0.000%"}},{"$f":"IF(V129=\"ja\",\"ja\",IF(O129=0,0,IF(OR(O129='Hilfstab Auswahl SOPÄ'!$C$7,O129='Hilfstab Auswahl SOPÄ'!$C$6,O129='Hilfstab Auswahl SOPÄ'!$C$13),\"ja\",\"nein\")))","v":"nein"},null,null,{"$f":"IF(OR(O129='Hilfstab Auswahl SOPÄ'!$C$11,O129='Hilfstab Auswahl SOPÄ'!$C$12)*AND(P129>1),\"* genehmigungspflichtige LK\",0)","v":0},null,"",0,{"$f":"VLOOKUP($A129,'Hilfstab Auswahl SOPÄ'!$G$6:$H$9,2,FALSE)","v":"leer"},{"$f":"IF(E129=0,\"\",IF(I129=0,\"Jahrgang fehlt\",IF(YEAR(I129)>'Hilfstab AE'!$B$16,0,IF(AND(YEAR(I129)<('Hilfstab AE'!$B$16+1),YEAR(I129)>('Hilfstab AE'!$D$16-1)),\"AE56-60\",\"AE61+\"))))","v":""},"leer ",{"$f":"IF(N129=\"ja\",IF(AND(M129>24.999%,M129<50.001%),'Hilfstab Auswahl SOPÄ'!$J$5/2,IF(M129>50%,'Hilfstab Auswahl SOPÄ'!$J$5,0)),0)","v":{"v":0,"d":"0.000%"}}]
["Auswählen","Auswählen",{"$nulls":5},"Auswählen",null,"Auswählen","Auswählen",{"$nulls":3},"Auswählen","Auswählen",{"$f":"VLOOKUP(O130&P130,CHOOSE({1,2},'Hilfstab Löhne'!$A$3:$A$187&'Hilfstab Löhne'!$B$3:$B$187,'Hilfstab Löhne'!$D$3:$D$187),2,0)","v":0},0,{"v":0,"d":"0.000%"},{"$f":"ROUND(IF(S130=0,0,IF(OR(S130='Hilfstab Auswahl SOPÄ'!$L$6,S130='Hilfstab Auswahl SOPÄ'!$L$8),IF(M130>1,'Hilfstab Auswahl SOPÄ'!$M$6,'Hilfstab Auswahl SOPÄ'!$M$6*M130),IF(OR(S130='Hilfstab Auswahl SOPÄ'!$L$7,S130='Hilfstab Auswahl SOPÄ'!$L$9),IF(M130>1,'Hilfstab Auswahl SOPÄ'!$M$7,'Hilfstab Auswahl SOPÄ'!$M$7*M130),IF(S130='Hilfstab Auswahl SOPÄ'!$L$10,IF(M130>1,'Hilfstab Auswahl SOPÄ'!$M$10,'Hilfstab Auswahl SOPÄ'!$M$10*M130),IF(M130>1,'Hilfstab Auswahl SOPÄ'!$M$11,'Hilfstab Auswahl SOPÄ'!$M$11*M130))))),5)+AE130","v":{"v":0,"d":"0.000%"}},{"$f":"IF(V130=\"ja\",\"ja\",IF(O130=0,0,IF(OR(O130='Hilfstab Auswahl SOPÄ'!$C$7,O130='Hilfstab Auswahl SOPÄ'!$C$6,O130='Hilfstab Auswahl SOPÄ'!$C$13),\"ja\",\"nein\")))","v":"nein"},null,null,{"$f":"IF(OR(O130='Hilfstab Auswahl SOPÄ'!$C$11,O130='Hilfstab Auswahl SOPÄ'!$C$12)*AND(P130>1),\"* genehmigungspflichtige LK\",0)","v":0},null,"",0,{"$f":"VLOOKUP($A130,'Hilfstab Auswahl SOPÄ'!$G$6:$H$9,2,FALSE)","v":"leer"},{"$f":"IF(E130=0,\"\",IF(I130=0,\"Jahrgang fehlt\",IF(YEAR(I130)>'Hilfstab AE'!$B$16,0,IF(AND(YEAR(I130)<('Hilfstab AE'!$B$16+1),YEAR(I130)>('Hilfstab AE'!$D$16-1)),\"AE56-60\",\"AE61+\"))))","v":""},"leer ",{"$f":"IF(N130=\"ja\",IF(AND(M130>24.999%,M130<50.001%),'Hilfstab Auswahl SOPÄ'!$J$5/2,IF(M130>50%,'Hilfstab Auswahl SOPÄ'!$J$5,0)),0)","v":{"v":0,"d":"0.000%"}}]
["Auswählen","Auswählen",{"$nulls":5},"Auswählen",null,"Auswählen","Auswählen",{"$nulls":3},"Auswählen","Auswählen",{"$f":"VLOOKUP(O131&P131,CHOOSE({1,2},'Hilfstab Löhne'!$A$3:$A$187&'Hilfstab Löhne'!$B$3:$B$187,'Hilfstab Löhne'!$D$3:$D$187),2,0)","v":0},0,{"v":0,"d":"0.000%"},{"$f":"ROUND(IF(S131=0,0,IF(OR(S131='Hilfstab Auswahl SOPÄ'!$L$6,S131='Hilfstab Auswahl SOPÄ'!$L$8),IF(M131>1,'Hilfstab Auswahl SOPÄ'!$M$6,'Hilfstab Auswahl SOPÄ'!$M$6*M131),IF(OR(S131='Hilfstab Auswahl SOPÄ'!$L$7,S131='Hilfstab Auswahl SOPÄ'!$L$9),IF(M131>1,'Hilfstab Auswahl SOPÄ'!$M$7,'Hilfstab Auswahl SOPÄ'!$M$7*M131),IF(S131='Hilfstab Auswahl SOPÄ'!$L$10,IF(M131>1,'Hilfstab Auswahl SOPÄ'!$M$10,'Hilfstab Auswahl SOPÄ'!$M$10*M131),IF(M131>1,'Hilfstab Auswahl SOPÄ'!$M$11,'Hilfstab Auswahl SOPÄ'!$M$11*M131))))),5)+AE131","v":{"v":0,"d":"0.000%"}},{"$f":"IF(V131=\"ja\",\"ja\",IF(O131=0,0,IF(OR(O131='Hilfstab Auswahl SOPÄ'!$C$7,O131='Hilfstab Auswahl SOPÄ'!$C$6,O131='Hilfstab Auswahl SOPÄ'!$C$13),\"ja\",\"nein\")))","v":"nein"},null,null,{"$f":"IF(OR(O131='Hilfstab Auswahl SOPÄ'!$C$11,O131='Hilfstab Auswahl SOPÄ'!$C$12)*AND(P131>1),\"* genehmigungspflichtige LK\",0)","v":0},null,"",0,{"$f":"VLOOKUP($A131,'Hilfstab Auswahl SOPÄ'!$G$6:$H$9,2,FALSE)","v":"leer"},{"$f":"IF(E131=0,\"\",IF(I131=0,\"Jahrgang fehlt\",IF(YEAR(I131)>'Hilfstab AE'!$B$16,0,IF(AND(YEAR(I131)<('Hilfstab AE'!$B$16+1),YEAR(I131)>('Hilfstab AE'!$D$16-1)),\"AE56-60\",\"AE61+\"))))","v":""},"leer ",{"$f":"IF(N131=\"ja\",IF(AND(M131>24.999%,M131<50.001%),'Hilfstab Auswahl SOPÄ'!$J$5/2,IF(M131>50%,'Hilfstab Auswahl SOPÄ'!$J$5,0)),0)","v":{"v":0,"d":"0.000%"}}]
["Auswählen","Auswählen",{"$nulls":5},"Auswählen",null,"Auswählen","Auswählen",{"$nulls":3},"Auswählen","Auswählen",{"$f":"VLOOKUP(O132&P132,CHOOSE({1,2},'Hilfstab Löhne'!$A$3:$A$187&'Hilfstab Löhne'!$B$3:$B$187,'Hilfstab Löhne'!$D$3:$D$187),2,0)","v":0},0,{"v":0,"d":"0.000%"},{"$f":"ROUND(IF(S132=0,0,IF(OR(S132='Hilfstab Auswahl SOPÄ'!$L$6,S132='Hilfstab Auswahl SOPÄ'!$L$8),IF(M132>1,'Hilfstab Auswahl SOPÄ'!$M$6,'Hilfstab Auswahl SOPÄ'!$M$6*M132),IF(OR(S132='Hilfstab Auswahl SOPÄ'!$L$7,S132='Hilfstab Auswahl SOPÄ'!$L$9),IF(M132>1,'Hilfstab Auswahl SOPÄ'!$M$7,'Hilfstab Auswahl SOPÄ'!$M$7*M132),IF(S132='Hilfstab Auswahl SOPÄ'!$L$10,IF(M132>1,'Hilfstab Auswahl SOPÄ'!$M$10,'Hilfstab Auswahl SOPÄ'!$M$10*M132),IF(M132>1,'Hilfstab Auswahl SOPÄ'!$M$11,'Hilfstab Auswahl SOPÄ'!$M$11*M132))))),5)+AE132","v":{"v":0,"d":"0.000%"}},{"$f":"IF(V132=\"ja\",\"ja\",IF(O132=0,0,IF(OR(O132='Hilfstab Auswahl SOPÄ'!$C$7,O132='Hilfstab Auswahl SOPÄ'!$C$6,O132='Hilfstab Auswahl SOPÄ'!$C$13),\"ja\",\"nein\")))","v":"nein"},null,null,{"$f":"IF(OR(O132='Hilfstab Auswahl SOPÄ'!$C$11,O132='Hilfstab Auswahl SOPÄ'!$C$12)*AND(P132>1),\"* genehmigungspflichtige LK\",0)","v":0},null,"",0,{"$f":"VLOOKUP($A132,'Hilfstab Auswahl SOPÄ'!$G$6:$H$9,2,FALSE)","v":"leer"},{"$f":"IF(E132=0,\"\",IF(I132=0,\"Jahrgang fehlt\",IF(YEAR(I132)>'Hilfstab AE'!$B$16,0,IF(AND(YEAR(I132)<('Hilfstab AE'!$B$16+1),YEAR(I132)>('Hilfstab AE'!$D$16-1)),\"AE56-60\",\"AE61+\"))))","v":""},"leer ",{"$f":"IF(N132=\"ja\",IF(AND(M132>24.999%,M132<50.001%),'Hilfstab Auswahl SOPÄ'!$J$5/2,IF(M132>50%,'Hilfstab Auswahl SOPÄ'!$J$5,0)),0)","v":{"v":0,"d":"0.000%"}}]
["Auswählen","Auswählen",{"$nulls":5},"Auswählen",null,"Auswählen","Auswählen",{"$nulls":3},"Auswählen","Auswählen",{"$f":"VLOOKUP(O133&P133,CHOOSE({1,2},'Hilfstab Löhne'!$A$3:$A$187&'Hilfstab Löhne'!$B$3:$B$187,'Hilfstab Löhne'!$D$3:$D$187),2,0)","v":0},0,{"v":0,"d":"0.000%"},{"$f":"ROUND(IF(S133=0,0,IF(OR(S133='Hilfstab Auswahl SOPÄ'!$L$6,S133='Hilfstab Auswahl SOPÄ'!$L$8),IF(M133>1,'Hilfstab Auswahl SOPÄ'!$M$6,'Hilfstab Auswahl SOPÄ'!$M$6*M133),IF(OR(S133='Hilfstab Auswahl SOPÄ'!$L$7,S133='Hilfstab Auswahl SOPÄ'!$L$9),IF(M133>1,'Hilfstab Auswahl SOPÄ'!$M$7,'Hilfstab Auswahl SOPÄ'!$M$7*M133),IF(S133='Hilfstab Auswahl SOPÄ'!$L$10,IF(M133>1,'Hilfstab Auswahl SOPÄ'!$M$10,'Hilfstab Auswahl SOPÄ'!$M$10*M133),IF(M133>1,'Hilfstab Auswahl SOPÄ'!$M$11,'Hilfstab Auswahl SOPÄ'!$M$11*M133))))),5)+AE133","v":{"v":0,"d":"0.000%"}},{"$f":"IF(V133=\"ja\",\"ja\",IF(O133=0,0,IF(OR(O133='Hilfstab Auswahl SOPÄ'!$C$7,O133='Hilfstab Auswahl SOPÄ'!$C$6,O133='Hilfstab Auswahl SOPÄ'!$C$13),\"ja\",\"nein\")))","v":"nein"},null,null,{"$f":"IF(OR(O133='Hilfstab Auswahl SOPÄ'!$C$11,O133='Hilfstab Auswahl SOPÄ'!$C$12)*AND(P133>1),\"* genehmigungspflichtige LK\",0)","v":0},null,"",0,{"$f":"VLOOKUP($A133,'Hilfstab Auswahl SOPÄ'!$G$6:$H$9,2,FALSE)","v":"leer"},{"$f":"IF(E133=0,\"\",IF(I133=0,\"Jahrgang fehlt\",IF(YEAR(I133)>'Hilfstab AE'!$B$16,0,IF(AND(YEAR(I133)<('Hilfstab AE'!$B$16+1),YEAR(I133)>('Hilfstab AE'!$D$16-1)),\"AE56-60\",\"AE61+\"))))","v":""},"leer ",{"$f":"IF(N133=\"ja\",IF(AND(M133>24.999%,M133<50.001%),'Hilfstab Auswahl SOPÄ'!$J$5/2,IF(M133>50%,'Hilfstab Auswahl SOPÄ'!$J$5,0)),0)","v":{"v":0,"d":"0.000%"}}]
["Auswählen","Auswählen",{"$nulls":5},"Auswählen",null,"Auswählen","Auswählen",{"$nulls":3},"Auswählen","Auswählen",{"$f":"VLOOKUP(O134&P134,CHOOSE({1,2},'Hilfstab Löhne'!$A$3:$A$187&'Hilfstab Löhne'!$B$3:$B$187,'Hilfstab Löhne'!$D$3:$D$187),2,0)","v":0},0,{"v":0,"d":"0.000%"},{"$f":"ROUND(IF(S134=0,0,IF(OR(S134='Hilfstab Auswahl SOPÄ'!$L$6,S134='Hilfstab Auswahl SOPÄ'!$L$8),IF(M134>1,'Hilfstab Auswahl SOPÄ'!$M$6,'Hilfstab Auswahl SOPÄ'!$M$6*M134),IF(OR(S134='Hilfstab Auswahl SOPÄ'!$L$7,S134='Hilfstab Auswahl SOPÄ'!$L$9),IF(M134>1,'Hilfstab Auswahl SOPÄ'!$M$7,'Hilfstab Auswahl SOPÄ'!$M$7*M134),IF(S134='Hilfstab Auswahl SOPÄ'!$L$10,IF(M134>1,'Hilfstab Auswahl SOPÄ'!$M$10,'Hilfstab Auswahl SOPÄ'!$M$10*M134),IF(M134>1,'Hilfstab Auswahl SOPÄ'!$M$11,'Hilfstab Auswahl SOPÄ'!$M$11*M134))))),5)+AE134","v":{"v":0,"d":"0.000%"}},{"$f":"IF(V134=\"ja\",\"ja\",IF(O134=0,0,IF(OR(O134='Hilfstab Auswahl SOPÄ'!$C$7,O134='Hilfstab Auswahl SOPÄ'!$C$6,O134='Hilfstab Auswahl SOPÄ'!$C$13),\"ja\",\"nein\")))","v":"nein"},null,null,{"$f":"IF(OR(O134='Hilfstab Auswahl SOPÄ'!$C$11,O134='Hilfstab Auswahl SOPÄ'!$C$12)*AND(P134>1),\"* genehmigungspflichtige LK\",0)","v":0},null,"",0,{"$f":"VLOOKUP($A134,'Hilfstab Auswahl SOPÄ'!$G$6:$H$9,2,FALSE)","v":"leer"},{"$f":"IF(E134=0,\"\",IF(I134=0,\"Jahrgang fehlt\",IF(YEAR(I134)>'Hilfstab AE'!$B$16,0,IF(AND(YEAR(I134)<('Hilfstab AE'!$B$16+1),YEAR(I134)>('Hilfstab AE'!$D$16-1)),\"AE56-60\",\"AE61+\"))))","v":""},"leer ",{"$f":"IF(N134=\"ja\",IF(AND(M134>24.999%,M134<50.001%),'Hilfstab Auswahl SOPÄ'!$J$5/2,IF(M134>50%,'Hilfstab Auswahl SOPÄ'!$J$5,0)),0)","v":{"v":0,"d":"0.000%"}}]
["Auswählen","Auswählen",{"$nulls":5},"Auswählen",null,"Auswählen","Auswählen",{"$nulls":3},"Auswählen","Auswählen",{"$f":"VLOOKUP(O135&P135,CHOOSE({1,2},'Hilfstab Löhne'!$A$3:$A$187&'Hilfstab Löhne'!$B$3:$B$187,'Hilfstab Löhne'!$D$3:$D$187),2,0)","v":0},0,{"v":0,"d":"0.000%"},{"$f":"ROUND(IF(S135=0,0,IF(OR(S135='Hilfstab Auswahl SOPÄ'!$L$6,S135='Hilfstab Auswahl SOPÄ'!$L$8),IF(M135>1,'Hilfstab Auswahl SOPÄ'!$M$6,'Hilfstab Auswahl SOPÄ'!$M$6*M135),IF(OR(S135='Hilfstab Auswahl SOPÄ'!$L$7,S135='Hilfstab Auswahl SOPÄ'!$L$9),IF(M135>1,'Hilfstab Auswahl SOPÄ'!$M$7,'Hilfstab Auswahl SOPÄ'!$M$7*M135),IF(S135='Hilfstab Auswahl SOPÄ'!$L$10,IF(M135>1,'Hilfstab Auswahl SOPÄ'!$M$10,'Hilfstab Auswahl SOPÄ'!$M$10*M135),IF(M135>1,'Hilfstab Auswahl SOPÄ'!$M$11,'Hilfstab Auswahl SOPÄ'!$M$11*M135))))),5)+AE135","v":{"v":0,"d":"0.000%"}},{"$f":"IF(V135=\"ja\",\"ja\",IF(O135=0,0,IF(OR(O135='Hilfstab Auswahl SOPÄ'!$C$7,O135='Hilfstab Auswahl SOPÄ'!$C$6,O135='Hilfstab Auswahl SOPÄ'!$C$13),\"ja\",\"nein\")))","v":"nein"},null,null,{"$f":"IF(OR(O135='Hilfstab Auswahl SOPÄ'!$C$11,O135='Hilfstab Auswahl SOPÄ'!$C$12)*AND(P135>1),\"* genehmigungspflichtige LK\",0)","v":0},null,"",0,{"$f":"VLOOKUP($A135,'Hilfstab Auswahl SOPÄ'!$G$6:$H$9,2,FALSE)","v":"leer"},{"$f":"IF(E135=0,\"\",IF(I135=0,\"Jahrgang fehlt\",IF(YEAR(I135)>'Hilfstab AE'!$B$16,0,IF(AND(YEAR(I135)<('Hilfstab AE'!$B$16+1),YEAR(I135)>('Hilfstab AE'!$D$16-1)),\"AE56-60\",\"AE61+\"))))","v":""},"leer ",{"$f":"IF(N135=\"ja\",IF(AND(M135>24.999%,M135<50.001%),'Hilfstab Auswahl SOPÄ'!$J$5/2,IF(M135>50%,'Hilfstab Auswahl SOPÄ'!$J$5,0)),0)","v":{"v":0,"d":"0.000%"}}]
["Auswählen","Auswählen",{"$nulls":5},"Auswählen",null,"Auswählen","Auswählen",{"$nulls":3},"Auswählen","Auswählen",{"$f":"VLOOKUP(O136&P136,CHOOSE({1,2},'Hilfstab Löhne'!$A$3:$A$187&'Hilfstab Löhne'!$B$3:$B$187,'Hilfstab Löhne'!$D$3:$D$187),2,0)","v":0},0,{"v":0,"d":"0.000%"},{"$f":"ROUND(IF(S136=0,0,IF(OR(S136='Hilfstab Auswahl SOPÄ'!$L$6,S136='Hilfstab Auswahl SOPÄ'!$L$8),IF(M136>1,'Hilfstab Auswahl SOPÄ'!$M$6,'Hilfstab Auswahl SOPÄ'!$M$6*M136),IF(OR(S136='Hilfstab Auswahl SOPÄ'!$L$7,S136='Hilfstab Auswahl SOPÄ'!$L$9),IF(M136>1,'Hilfstab Auswahl SOPÄ'!$M$7,'Hilfstab Auswahl SOPÄ'!$M$7*M136),IF(S136='Hilfstab Auswahl SOPÄ'!$L$10,IF(M136>1,'Hilfstab Auswahl SOPÄ'!$M$10,'Hilfstab Auswahl SOPÄ'!$M$10*M136),IF(M136>1,'Hilfstab Auswahl SOPÄ'!$M$11,'Hilfstab Auswahl SOPÄ'!$M$11*M136))))),5)+AE136","v":{"v":0,"d":"0.000%"}},{"$f":"IF(V136=\"ja\",\"ja\",IF(O136=0,0,IF(OR(O136='Hilfstab Auswahl SOPÄ'!$C$7,O136='Hilfstab Auswahl SOPÄ'!$C$6,O136='Hilfstab Auswahl SOPÄ'!$C$13),\"ja\",\"nein\")))","v":"nein"},null,null,{"$f":"IF(OR(O136='Hilfstab Auswahl SOPÄ'!$C$11,O136='Hilfstab Auswahl SOPÄ'!$C$12)*AND(P136>1),\"* genehmigungspflichtige LK\",0)","v":0},null,"",0,{"$f":"VLOOKUP($A136,'Hilfstab Auswahl SOPÄ'!$G$6:$H$9,2,FALSE)","v":"leer"},{"$f":"IF(E136=0,\"\",IF(I136=0,\"Jahrgang fehlt\",IF(YEAR(I136)>'Hilfstab AE'!$B$16,0,IF(AND(YEAR(I136)<('Hilfstab AE'!$B$16+1),YEAR(I136)>('Hilfstab AE'!$D$16-1)),\"AE56-60\",\"AE61+\"))))","v":""},"leer ",{"$f":"IF(N136=\"ja\",IF(AND(M136>24.999%,M136<50.001%),'Hilfstab Auswahl SOPÄ'!$J$5/2,IF(M136>50%,'Hilfstab Auswahl SOPÄ'!$J$5,0)),0)","v":{"v":0,"d":"0.000%"}}]
["Auswählen","Auswählen",{"$nulls":5},"Auswählen",null,"Auswählen","Auswählen",{"$nulls":3},"Auswählen","Auswählen",{"$f":"VLOOKUP(O137&P137,CHOOSE({1,2},'Hilfstab Löhne'!$A$3:$A$187&'Hilfstab Löhne'!$B$3:$B$187,'Hilfstab Löhne'!$D$3:$D$187),2,0)","v":0},0,{"v":0,"d":"0.000%"},{"$f":"ROUND(IF(S137=0,0,IF(OR(S137='Hilfstab Auswahl SOPÄ'!$L$6,S137='Hilfstab Auswahl SOPÄ'!$L$8),IF(M137>1,'Hilfstab Auswahl SOPÄ'!$M$6,'Hilfstab Auswahl SOPÄ'!$M$6*M137),IF(OR(S137='Hilfstab Auswahl SOPÄ'!$L$7,S137='Hilfstab Auswahl SOPÄ'!$L$9),IF(M137>1,'Hilfstab Auswahl SOPÄ'!$M$7,'Hilfstab Auswahl SOPÄ'!$M$7*M137),IF(S137='Hilfstab Auswahl SOPÄ'!$L$10,IF(M137>1,'Hilfstab Auswahl SOPÄ'!$M$10,'Hilfstab Auswahl SOPÄ'!$M$10*M137),IF(M137>1,'Hilfstab Auswahl SOPÄ'!$M$11,'Hilfstab Auswahl SOPÄ'!$M$11*M137))))),5)+AE137","v":{"v":0,"d":"0.000%"}},{"$f":"IF(V137=\"ja\",\"ja\",IF(O137=0,0,IF(OR(O137='Hilfstab Auswahl SOPÄ'!$C$7,O137='Hilfstab Auswahl SOPÄ'!$C$6,O137='Hilfstab Auswahl SOPÄ'!$C$13),\"ja\",\"nein\")))","v":"nein"},null,null,{"$f":"IF(OR(O137='Hilfstab Auswahl SOPÄ'!$C$11,O137='Hilfstab Auswahl SOPÄ'!$C$12)*AND(P137>1),\"* genehmigungspflichtige LK\",0)","v":0},null,"",0,{"$f":"VLOOKUP($A137,'Hilfstab Auswahl SOPÄ'!$G$6:$H$9,2,FALSE)","v":"leer"},{"$f":"IF(E137=0,\"\",IF(I137=0,\"Jahrgang fehlt\",IF(YEAR(I137)>'Hilfstab AE'!$B$16,0,IF(AND(YEAR(I137)<('Hilfstab AE'!$B$16+1),YEAR(I137)>('Hilfstab AE'!$D$16-1)),\"AE56-60\",\"AE61+\"))))","v":""},"leer ",{"$f":"IF(N137=\"ja\",IF(AND(M137>24.999%,M137<50.001%),'Hilfstab Auswahl SOPÄ'!$J$5/2,IF(M137>50%,'Hilfstab Auswahl SOPÄ'!$J$5,0)),0)","v":{"v":0,"d":"0.000%"}}]
["Auswählen","Auswählen",{"$nulls":5},"Auswählen",null,"Auswählen","Auswählen",{"$nulls":3},"Auswählen","Auswählen",{"$f":"VLOOKUP(O138&P138,CHOOSE({1,2},'Hilfstab Löhne'!$A$3:$A$187&'Hilfstab Löhne'!$B$3:$B$187,'Hilfstab Löhne'!$D$3:$D$187),2,0)","v":0},0,{"v":0,"d":"0.000%"},{"$f":"ROUND(IF(S138=0,0,IF(OR(S138='Hilfstab Auswahl SOPÄ'!$L$6,S138='Hilfstab Auswahl SOPÄ'!$L$8),IF(M138>1,'Hilfstab Auswahl SOPÄ'!$M$6,'Hilfstab Auswahl SOPÄ'!$M$6*M138),IF(OR(S138='Hilfstab Auswahl SOPÄ'!$L$7,S138='Hilfstab Auswahl SOPÄ'!$L$9),IF(M138>1,'Hilfstab Auswahl SOPÄ'!$M$7,'Hilfstab Auswahl SOPÄ'!$M$7*M138),IF(S138='Hilfstab Auswahl SOPÄ'!$L$10,IF(M138>1,'Hilfstab Auswahl SOPÄ'!$M$10,'Hilfstab Auswahl SOPÄ'!$M$10*M138),IF(M138>1,'Hilfstab Auswahl SOPÄ'!$M$11,'Hilfstab Auswahl SOPÄ'!$M$11*M138))))),5)+AE138","v":{"v":0,"d":"0.000%"}},{"$f":"IF(V138=\"ja\",\"ja\",IF(O138=0,0,IF(OR(O138='Hilfstab Auswahl SOPÄ'!$C$7,O138='Hilfstab Auswahl SOPÄ'!$C$6,O138='Hilfstab Auswahl SOPÄ'!$C$13),\"ja\",\"nein\")))","v":"nein"},null,null,{"$f":"IF(OR(O138='Hilfstab Auswahl SOPÄ'!$C$11,O138='Hilfstab Auswahl SOPÄ'!$C$12)*AND(P138>1),\"* genehmigungspflichtige LK\",0)","v":0},null,"",0,{"$f":"VLOOKUP($A138,'Hilfstab Auswahl SOPÄ'!$G$6:$H$9,2,FALSE)","v":"leer"},{"$f":"IF(E138=0,\"\",IF(I138=0,\"Jahrgang fehlt\",IF(YEAR(I138)>'Hilfstab AE'!$B$16,0,IF(AND(YEAR(I138)<('Hilfstab AE'!$B$16+1),YEAR(I138)>('Hilfstab AE'!$D$16-1)),\"AE56-60\",\"AE61+\"))))","v":""},"leer ",{"$f":"IF(N138=\"ja\",IF(AND(M138>24.999%,M138<50.001%),'Hilfstab Auswahl SOPÄ'!$J$5/2,IF(M138>50%,'Hilfstab Auswahl SOPÄ'!$J$5,0)),0)","v":{"v":0,"d":"0.000%"}}]
["Auswählen","Auswählen",{"$nulls":5},"Auswählen",null,"Auswählen","Auswählen",{"$nulls":3},"Auswählen","Auswählen",{"$f":"VLOOKUP(O139&P139,CHOOSE({1,2},'Hilfstab Löhne'!$A$3:$A$187&'Hilfstab Löhne'!$B$3:$B$187,'Hilfstab Löhne'!$D$3:$D$187),2,0)","v":0},0,{"v":0,"d":"0.000%"},{"$f":"ROUND(IF(S139=0,0,IF(OR(S139='Hilfstab Auswahl SOPÄ'!$L$6,S139='Hilfstab Auswahl SOPÄ'!$L$8),IF(M139>1,'Hilfstab Auswahl SOPÄ'!$M$6,'Hilfstab Auswahl SOPÄ'!$M$6*M139),IF(OR(S139='Hilfstab Auswahl SOPÄ'!$L$7,S139='Hilfstab Auswahl SOPÄ'!$L$9),IF(M139>1,'Hilfstab Auswahl SOPÄ'!$M$7,'Hilfstab Auswahl SOPÄ'!$M$7*M139),IF(S139='Hilfstab Auswahl SOPÄ'!$L$10,IF(M139>1,'Hilfstab Auswahl SOPÄ'!$M$10,'Hilfstab Auswahl SOPÄ'!$M$10*M139),IF(M139>1,'Hilfstab Auswahl SOPÄ'!$M$11,'Hilfstab Auswahl SOPÄ'!$M$11*M139))))),5)+AE139","v":{"v":0,"d":"0.000%"}},{"$f":"IF(V139=\"ja\",\"ja\",IF(O139=0,0,IF(OR(O139='Hilfstab Auswahl SOPÄ'!$C$7,O139='Hilfstab Auswahl SOPÄ'!$C$6,O139='Hilfstab Auswahl SOPÄ'!$C$13),\"ja\",\"nein\")))","v":"nein"},null,null,{"$f":"IF(OR(O139='Hilfstab Auswahl SOPÄ'!$C$11,O139='Hilfstab Auswahl SOPÄ'!$C$12)*AND(P139>1),\"* genehmigungspflichtige LK\",0)","v":0},null,"",0,{"$f":"VLOOKUP($A139,'Hilfstab Auswahl SOPÄ'!$G$6:$H$9,2,FALSE)","v":"leer"},{"$f":"IF(E139=0,\"\",IF(I139=0,\"Jahrgang fehlt\",IF(YEAR(I139)>'Hilfstab AE'!$B$16,0,IF(AND(YEAR(I139)<('Hilfstab AE'!$B$16+1),YEAR(I139)>('Hilfstab AE'!$D$16-1)),\"AE56-60\",\"AE61+\"))))","v":""},"leer ",{"$f":"IF(N139=\"ja\",IF(AND(M139>24.999%,M139<50.001%),'Hilfstab Auswahl SOPÄ'!$J$5/2,IF(M139>50%,'Hilfstab Auswahl SOPÄ'!$J$5,0)),0)","v":{"v":0,"d":"0.000%"}}]
["Auswählen","Auswählen",{"$nulls":5},"Auswählen",null,"Auswählen","Auswählen",{"$nulls":3},"Auswählen","Auswählen",{"$f":"VLOOKUP(O140&P140,CHOOSE({1,2},'Hilfstab Löhne'!$A$3:$A$187&'Hilfstab Löhne'!$B$3:$B$187,'Hilfstab Löhne'!$D$3:$D$187),2,0)","v":0},0,{"v":0,"d":"0.000%"},{"$f":"ROUND(IF(S140=0,0,IF(OR(S140='Hilfstab Auswahl SOPÄ'!$L$6,S140='Hilfstab Auswahl SOPÄ'!$L$8),IF(M140>1,'Hilfstab Auswahl SOPÄ'!$M$6,'Hilfstab Auswahl SOPÄ'!$M$6*M140),IF(OR(S140='Hilfstab Auswahl SOPÄ'!$L$7,S140='Hilfstab Auswahl SOPÄ'!$L$9),IF(M140>1,'Hilfstab Auswahl SOPÄ'!$M$7,'Hilfstab Auswahl SOPÄ'!$M$7*M140),IF(S140='Hilfstab Auswahl SOPÄ'!$L$10,IF(M140>1,'Hilfstab Auswahl SOPÄ'!$M$10,'Hilfstab Auswahl SOPÄ'!$M$10*M140),IF(M140>1,'Hilfstab Auswahl SOPÄ'!$M$11,'Hilfstab Auswahl SOPÄ'!$M$11*M140))))),5)+AE140","v":{"v":0,"d":"0.000%"}},{"$f":"IF(V140=\"ja\",\"ja\",IF(O140=0,0,IF(OR(O140='Hilfstab Auswahl SOPÄ'!$C$7,O140='Hilfstab Auswahl SOPÄ'!$C$6,O140='Hilfstab Auswahl SOPÄ'!$C$13),\"ja\",\"nein\")))","v":"nein"},null,null,{"$f":"IF(OR(O140='Hilfstab Auswahl SOPÄ'!$C$11,O140='Hilfstab Auswahl SOPÄ'!$C$12)*AND(P140>1),\"* genehmigungspflichtige LK\",0)","v":0},null,"",0,{"$f":"VLOOKUP($A140,'Hilfstab Auswahl SOPÄ'!$G$6:$H$9,2,FALSE)","v":"leer"},{"$f":"IF(E140=0,\"\",IF(I140=0,\"Jahrgang fehlt\",IF(YEAR(I140)>'Hilfstab AE'!$B$16,0,IF(AND(YEAR(I140)<('Hilfstab AE'!$B$16+1),YEAR(I140)>('Hilfstab AE'!$D$16-1)),\"AE56-60\",\"AE61+\"))))","v":""},"leer ",{"$f":"IF(N140=\"ja\",IF(AND(M140>24.999%,M140<50.001%),'Hilfstab Auswahl SOPÄ'!$J$5/2,IF(M140>50%,'Hilfstab Auswahl SOPÄ'!$J$5,0)),0)","v":{"v":0,"d":"0.000%"}}]
["Auswählen","Auswählen",{"$nulls":5},"Auswählen",null,"Auswählen","Auswählen",{"$nulls":3},"Auswählen","Auswählen",{"$f":"VLOOKUP(O141&P141,CHOOSE({1,2},'Hilfstab Löhne'!$A$3:$A$187&'Hilfstab Löhne'!$B$3:$B$187,'Hilfstab Löhne'!$D$3:$D$187),2,0)","v":0},0,{"v":0,"d":"0.000%"},{"$f":"ROUND(IF(S141=0,0,IF(OR(S141='Hilfstab Auswahl SOPÄ'!$L$6,S141='Hilfstab Auswahl SOPÄ'!$L$8),IF(M141>1,'Hilfstab Auswahl SOPÄ'!$M$6,'Hilfstab Auswahl SOPÄ'!$M$6*M141),IF(OR(S141='Hilfstab Auswahl SOPÄ'!$L$7,S141='Hilfstab Auswahl SOPÄ'!$L$9),IF(M141>1,'Hilfstab Auswahl SOPÄ'!$M$7,'Hilfstab Auswahl SOPÄ'!$M$7*M141),IF(S141='Hilfstab Auswahl SOPÄ'!$L$10,IF(M141>1,'Hilfstab Auswahl SOPÄ'!$M$10,'Hilfstab Auswahl SOPÄ'!$M$10*M141),IF(M141>1,'Hilfstab Auswahl SOPÄ'!$M$11,'Hilfstab Auswahl SOPÄ'!$M$11*M141))))),5)+AE141","v":{"v":0,"d":"0.000%"}},{"$f":"IF(V141=\"ja\",\"ja\",IF(O141=0,0,IF(OR(O141='Hilfstab Auswahl SOPÄ'!$C$7,O141='Hilfstab Auswahl SOPÄ'!$C$6,O141='Hilfstab Auswahl SOPÄ'!$C$13),\"ja\",\"nein\")))","v":"nein"},null,null,{"$f":"IF(OR(O141='Hilfstab Auswahl SOPÄ'!$C$11,O141='Hilfstab Auswahl SOPÄ'!$C$12)*AND(P141>1),\"* genehmigungspflichtige LK\",0)","v":0},null,"",0,{"$f":"VLOOKUP($A141,'Hilfstab Auswahl SOPÄ'!$G$6:$H$9,2,FALSE)","v":"leer"},{"$f":"IF(E141=0,\"\",IF(I141=0,\"Jahrgang fehlt\",IF(YEAR(I141)>'Hilfstab AE'!$B$16,0,IF(AND(YEAR(I141)<('Hilfstab AE'!$B$16+1),YEAR(I141)>('Hilfstab AE'!$D$16-1)),\"AE56-60\",\"AE61+\"))))","v":""},"leer ",{"$f":"IF(N141=\"ja\",IF(AND(M141>24.999%,M141<50.001%),'Hilfstab Auswahl SOPÄ'!$J$5/2,IF(M141>50%,'Hilfstab Auswahl SOPÄ'!$J$5,0)),0)","v":{"v":0,"d":"0.000%"}}]
["Auswählen","Auswählen",{"$nulls":5},"Auswählen",null,"Auswählen","Auswählen",{"$nulls":3},"Auswählen","Auswählen",{"$f":"VLOOKUP(O142&P142,CHOOSE({1,2},'Hilfstab Löhne'!$A$3:$A$187&'Hilfstab Löhne'!$B$3:$B$187,'Hilfstab Löhne'!$D$3:$D$187),2,0)","v":0},0,{"v":0,"d":"0.000%"},{"$f":"ROUND(IF(S142=0,0,IF(OR(S142='Hilfstab Auswahl SOPÄ'!$L$6,S142='Hilfstab Auswahl SOPÄ'!$L$8),IF(M142>1,'Hilfstab Auswahl SOPÄ'!$M$6,'Hilfstab Auswahl SOPÄ'!$M$6*M142),IF(OR(S142='Hilfstab Auswahl SOPÄ'!$L$7,S142='Hilfstab Auswahl SOPÄ'!$L$9),IF(M142>1,'Hilfstab Auswahl SOPÄ'!$M$7,'Hilfstab Auswahl SOPÄ'!$M$7*M142),IF(S142='Hilfstab Auswahl SOPÄ'!$L$10,IF(M142>1,'Hilfstab Auswahl SOPÄ'!$M$10,'Hilfstab Auswahl SOPÄ'!$M$10*M142),IF(M142>1,'Hilfstab Auswahl SOPÄ'!$M$11,'Hilfstab Auswahl SOPÄ'!$M$11*M142))))),5)+AE142","v":{"v":0,"d":"0.000%"}},{"$f":"IF(V142=\"ja\",\"ja\",IF(O142=0,0,IF(OR(O142='Hilfstab Auswahl SOPÄ'!$C$7,O142='Hilfstab Auswahl SOPÄ'!$C$6,O142='Hilfstab Auswahl SOPÄ'!$C$13),\"ja\",\"nein\")))","v":"nein"},null,null,{"$f":"IF(OR(O142='Hilfstab Auswahl SOPÄ'!$C$11,O142='Hilfstab Auswahl SOPÄ'!$C$12)*AND(P142>1),\"* genehmigungspflichtige LK\",0)","v":0},null,"",0,{"$f":"VLOOKUP($A142,'Hilfstab Auswahl SOPÄ'!$G$6:$H$9,2,FALSE)","v":"leer"},{"$f":"IF(E142=0,\"\",IF(I142=0,\"Jahrgang fehlt\",IF(YEAR(I142)>'Hilfstab AE'!$B$16,0,IF(AND(YEAR(I142)<('Hilfstab AE'!$B$16+1),YEAR(I142)>('Hilfstab AE'!$D$16-1)),\"AE56-60\",\"AE61+\"))))","v":""},"leer ",{"$f":"IF(N142=\"ja\",IF(AND(M142>24.999%,M142<50.001%),'Hilfstab Auswahl SOPÄ'!$J$5/2,IF(M142>50%,'Hilfstab Auswahl SOPÄ'!$J$5,0)),0)","v":{"v":0,"d":"0.000%"}}]
["Auswählen","Auswählen",{"$nulls":5},"Auswählen",null,"Auswählen","Auswählen",{"$nulls":3},"Auswählen","Auswählen",{"$f":"VLOOKUP(O143&P143,CHOOSE({1,2},'Hilfstab Löhne'!$A$3:$A$187&'Hilfstab Löhne'!$B$3:$B$187,'Hilfstab Löhne'!$D$3:$D$187),2,0)","v":0},0,{"v":0,"d":"0.000%"},{"$f":"ROUND(IF(S143=0,0,IF(OR(S143='Hilfstab Auswahl SOPÄ'!$L$6,S143='Hilfstab Auswahl SOPÄ'!$L$8),IF(M143>1,'Hilfstab Auswahl SOPÄ'!$M$6,'Hilfstab Auswahl SOPÄ'!$M$6*M143),IF(OR(S143='Hilfstab Auswahl SOPÄ'!$L$7,S143='Hilfstab Auswahl SOPÄ'!$L$9),IF(M143>1,'Hilfstab Auswahl SOPÄ'!$M$7,'Hilfstab Auswahl SOPÄ'!$M$7*M143),IF(S143='Hilfstab Auswahl SOPÄ'!$L$10,IF(M143>1,'Hilfstab Auswahl SOPÄ'!$M$10,'Hilfstab Auswahl SOPÄ'!$M$10*M143),IF(M143>1,'Hilfstab Auswahl SOPÄ'!$M$11,'Hilfstab Auswahl SOPÄ'!$M$11*M143))))),5)+AE143","v":{"v":0,"d":"0.000%"}},{"$f":"IF(V143=\"ja\",\"ja\",IF(O143=0,0,IF(OR(O143='Hilfstab Auswahl SOPÄ'!$C$7,O143='Hilfstab Auswahl SOPÄ'!$C$6,O143='Hilfstab Auswahl SOPÄ'!$C$13),\"ja\",\"nein\")))","v":"nein"},null,null,{"$f":"IF(OR(O143='Hilfstab Auswahl SOPÄ'!$C$11,O143='Hilfstab Auswahl SOPÄ'!$C$12)*AND(P143>1),\"* genehmigungspflichtige LK\",0)","v":0},null,"",0,{"$f":"VLOOKUP($A143,'Hilfstab Auswahl SOPÄ'!$G$6:$H$9,2,FALSE)","v":"leer"},{"$f":"IF(E143=0,\"\",IF(I143=0,\"Jahrgang fehlt\",IF(YEAR(I143)>'Hilfstab AE'!$B$16,0,IF(AND(YEAR(I143)<('Hilfstab AE'!$B$16+1),YEAR(I143)>('Hilfstab AE'!$D$16-1)),\"AE56-60\",\"AE61+\"))))","v":""},"leer ",{"$f":"IF(N143=\"ja\",IF(AND(M143>24.999%,M143<50.001%),'Hilfstab Auswahl SOPÄ'!$J$5/2,IF(M143>50%,'Hilfstab Auswahl SOPÄ'!$J$5,0)),0)","v":{"v":0,"d":"0.000%"}}]
["Auswählen","Auswählen",{"$nulls":5},"Auswählen",null,"Auswählen","Auswählen",{"$nulls":3},"Auswählen","Auswählen",{"$f":"VLOOKUP(O144&P144,CHOOSE({1,2},'Hilfstab Löhne'!$A$3:$A$187&'Hilfstab Löhne'!$B$3:$B$187,'Hilfstab Löhne'!$D$3:$D$187),2,0)","v":0},0,{"v":0,"d":"0.000%"},{"$f":"ROUND(IF(S144=0,0,IF(OR(S144='Hilfstab Auswahl SOPÄ'!$L$6,S144='Hilfstab Auswahl SOPÄ'!$L$8),IF(M144>1,'Hilfstab Auswahl SOPÄ'!$M$6,'Hilfstab Auswahl SOPÄ'!$M$6*M144),IF(OR(S144='Hilfstab Auswahl SOPÄ'!$L$7,S144='Hilfstab Auswahl SOPÄ'!$L$9),IF(M144>1,'Hilfstab Auswahl SOPÄ'!$M$7,'Hilfstab Auswahl SOPÄ'!$M$7*M144),IF(S144='Hilfstab Auswahl SOPÄ'!$L$10,IF(M144>1,'Hilfstab Auswahl SOPÄ'!$M$10,'Hilfstab Auswahl SOPÄ'!$M$10*M144),IF(M144>1,'Hilfstab Auswahl SOPÄ'!$M$11,'Hilfstab Auswahl SOPÄ'!$M$11*M144))))),5)+AE144","v":{"v":0,"d":"0.000%"}},{"$f":"IF(V144=\"ja\",\"ja\",IF(O144=0,0,IF(OR(O144='Hilfstab Auswahl SOPÄ'!$C$7,O144='Hilfstab Auswahl SOPÄ'!$C$6,O144='Hilfstab Auswahl SOPÄ'!$C$13),\"ja\",\"nein\")))","v":"nein"},null,null,{"$f":"IF(OR(O144='Hilfstab Auswahl SOPÄ'!$C$11,O144='Hilfstab Auswahl SOPÄ'!$C$12)*AND(P144>1),\"* genehmigungspflichtige LK\",0)","v":0},null,"",0,{"$f":"VLOOKUP($A144,'Hilfstab Auswahl SOPÄ'!$G$6:$H$9,2,FALSE)","v":"leer"},{"$f":"IF(E144=0,\"\",IF(I144=0,\"Jahrgang fehlt\",IF(YEAR(I144)>'Hilfstab AE'!$B$16,0,IF(AND(YEAR(I144)<('Hilfstab AE'!$B$16+1),YEAR(I144)>('Hilfstab AE'!$D$16-1)),\"AE56-60\",\"AE61+\"))))","v":""},"leer ",{"$f":"IF(N144=\"ja\",IF(AND(M144>24.999%,M144<50.001%),'Hilfstab Auswahl SOPÄ'!$J$5/2,IF(M144>50%,'Hilfstab Auswahl SOPÄ'!$J$5,0)),0)","v":{"v":0,"d":"0.000%"}}]
["Auswählen","Auswählen",{"$nulls":5},"Auswählen",null,"Auswählen","Auswählen",{"$nulls":3},"Auswählen","Auswählen",{"$f":"VLOOKUP(O145&P145,CHOOSE({1,2},'Hilfstab Löhne'!$A$3:$A$187&'Hilfstab Löhne'!$B$3:$B$187,'Hilfstab Löhne'!$D$3:$D$187),2,0)","v":0},0,{"v":0,"d":"0.000%"},{"$f":"ROUND(IF(S145=0,0,IF(OR(S145='Hilfstab Auswahl SOPÄ'!$L$6,S145='Hilfstab Auswahl SOPÄ'!$L$8),IF(M145>1,'Hilfstab Auswahl SOPÄ'!$M$6,'Hilfstab Auswahl SOPÄ'!$M$6*M145),IF(OR(S145='Hilfstab Auswahl SOPÄ'!$L$7,S145='Hilfstab Auswahl SOPÄ'!$L$9),IF(M145>1,'Hilfstab Auswahl SOPÄ'!$M$7,'Hilfstab Auswahl SOPÄ'!$M$7*M145),IF(S145='Hilfstab Auswahl SOPÄ'!$L$10,IF(M145>1,'Hilfstab Auswahl SOPÄ'!$M$10,'Hilfstab Auswahl SOPÄ'!$M$10*M145),IF(M145>1,'Hilfstab Auswahl SOPÄ'!$M$11,'Hilfstab Auswahl SOPÄ'!$M$11*M145))))),5)+AE145","v":{"v":0,"d":"0.000%"}},{"$f":"IF(V145=\"ja\",\"ja\",IF(O145=0,0,IF(OR(O145='Hilfstab Auswahl SOPÄ'!$C$7,O145='Hilfstab Auswahl SOPÄ'!$C$6,O145='Hilfstab Auswahl SOPÄ'!$C$13),\"ja\",\"nein\")))","v":"nein"},null,null,{"$f":"IF(OR(O145='Hilfstab Auswahl SOPÄ'!$C$11,O145='Hilfstab Auswahl SOPÄ'!$C$12)*AND(P145>1),\"* genehmigungspflichtige LK\",0)","v":0},null,"",0,{"$f":"VLOOKUP($A145,'Hilfstab Auswahl SOPÄ'!$G$6:$H$9,2,FALSE)","v":"leer"},{"$f":"IF(E145=0,\"\",IF(I145=0,\"Jahrgang fehlt\",IF(YEAR(I145)>'Hilfstab AE'!$B$16,0,IF(AND(YEAR(I145)<('Hilfstab AE'!$B$16+1),YEAR(I145)>('Hilfstab AE'!$D$16-1)),\"AE56-60\",\"AE61+\"))))","v":""},"leer ",{"$f":"IF(N145=\"ja\",IF(AND(M145>24.999%,M145<50.001%),'Hilfstab Auswahl SOPÄ'!$J$5/2,IF(M145>50%,'Hilfstab Auswahl SOPÄ'!$J$5,0)),0)","v":{"v":0,"d":"0.000%"}}]
["Auswählen","Auswählen",{"$nulls":5},"Auswählen",null,"Auswählen","Auswählen",{"$nulls":3},"Auswählen","Auswählen",{"$f":"VLOOKUP(O146&P146,CHOOSE({1,2},'Hilfstab Löhne'!$A$3:$A$187&'Hilfstab Löhne'!$B$3:$B$187,'Hilfstab Löhne'!$D$3:$D$187),2,0)","v":0},0,{"$f":"IF(AA146<30%,0,IF(AC146=0,0,IF(AB146<>\"leer\",AD146,0)))","v":{"v":0,"d":"0.000%"}},{"$f":"ROUND(IF(S146=0,0,IF(OR(S146='Hilfstab Auswahl SOPÄ'!$L$6,S146='Hilfstab Auswahl SOPÄ'!$L$8),IF(M146>1,'Hilfstab Auswahl SOPÄ'!$M$6,'Hilfstab Auswahl SOPÄ'!$M$6*M146),IF(OR(S146='Hilfstab Auswahl SOPÄ'!$L$7,S146='Hilfstab Auswahl SOPÄ'!$L$9),IF(M146>1,'Hilfstab Auswahl SOPÄ'!$M$7,'Hilfstab Auswahl SOPÄ'!$M$7*M146),IF(S146='Hilfstab Auswahl SOPÄ'!$L$10,IF(M146>1,'Hilfstab Auswahl SOPÄ'!$M$10,'Hilfstab Auswahl SOPÄ'!$M$10*M146),IF(M146>1,'Hilfstab Auswahl SOPÄ'!$M$11,'Hilfstab Auswahl SOPÄ'!$M$11*M146))))),5)+AE146","v":{"v":0,"d":"0.000%"}},{"$f":"IF(V146=\"ja\",\"ja\",IF(O146=0,0,IF(OR(O146='Hilfstab Auswahl SOPÄ'!$C$7,O146='Hilfstab Auswahl SOPÄ'!$C$6,O146='Hilfstab Auswahl SOPÄ'!$C$13),\"ja\",\"nein\")))","v":"nein"},null,null,{"$f":"IF(OR(O146='Hilfstab Auswahl SOPÄ'!$C$11,O146='Hilfstab Auswahl SOPÄ'!$C$12)*AND(P146>1),\"* genehmigungspflichtige LK\",0)","v":0},null,{"$f":"IF(E146=\"\",\"\",CONCATENATE(E146,F146,I146))","v":""},0,{"$f":"VLOOKUP($A146,'Hilfstab Auswahl SOPÄ'!$G$6:$H$9,2,FALSE)","v":"leer"},{"$f":"IF(E146=0,\"\",IF(I146=0,\"Jahrgang fehlt\",IF(YEAR(I146)>'Hilfstab AE'!$B$16,0,IF(AND(YEAR(I146)<('Hilfstab AE'!$B$16+1),YEAR(I146)>('Hilfstab AE'!$D$16-1)),\"AE56-60\",\"AE61+\"))))","v":""},"leer ",{"$f":"IF(N146=\"ja\",IF(AND(M146>24.999%,M146<50.001%),'Hilfstab Auswahl SOPÄ'!$J$5/2,IF(M146>50%,'Hilfstab Auswahl SOPÄ'!$J$5,0)),0)","v":{"v":0,"d":"0.000%"}}]
["Auswählen","Auswählen",{"$nulls":5},"Auswählen",null,"Auswählen","Auswählen",{"$nulls":3},"Auswählen","Auswählen",{"$f":"VLOOKUP(O147&P147,CHOOSE({1,2},'Hilfstab Löhne'!$A$3:$A$187&'Hilfstab Löhne'!$B$3:$B$187,'Hilfstab Löhne'!$D$3:$D$187),2,0)","v":0},0,{"v":0,"d":"0.000%"},{"$f":"ROUND(IF(S147=0,0,IF(OR(S147='Hilfstab Auswahl SOPÄ'!$L$6,S147='Hilfstab Auswahl SOPÄ'!$L$8),IF(M147>1,'Hilfstab Auswahl SOPÄ'!$M$6,'Hilfstab Auswahl SOPÄ'!$M$6*M147),IF(OR(S147='Hilfstab Auswahl SOPÄ'!$L$7,S147='Hilfstab Auswahl SOPÄ'!$L$9),IF(M147>1,'Hilfstab Auswahl SOPÄ'!$M$7,'Hilfstab Auswahl SOPÄ'!$M$7*M147),IF(S147='Hilfstab Auswahl SOPÄ'!$L$10,IF(M147>1,'Hilfstab Auswahl SOPÄ'!$M$10,'Hilfstab Auswahl SOPÄ'!$M$10*M147),IF(M147>1,'Hilfstab Auswahl SOPÄ'!$M$11,'Hilfstab Auswahl SOPÄ'!$M$11*M147))))),5)+AE147","v":{"v":0,"d":"0.000%"}},{"$f":"IF(V147=\"ja\",\"ja\",IF(O147=0,0,IF(OR(O147='Hilfstab Auswahl SOPÄ'!$C$7,O147='Hilfstab Auswahl SOPÄ'!$C$6,O147='Hilfstab Auswahl SOPÄ'!$C$13),\"ja\",\"nein\")))","v":"nein"},null,null,{"$f":"IF(OR(O147='Hilfstab Auswahl SOPÄ'!$C$11,O147='Hilfstab Auswahl SOPÄ'!$C$12)*AND(P147>1),\"* genehmigungspflichtige LK\",0)","v":0},null,"",0,{"$f":"VLOOKUP($A147,'Hilfstab Auswahl SOPÄ'!$G$6:$H$9,2,FALSE)","v":"leer"},{"$f":"IF(E147=0,\"\",IF(I147=0,\"Jahrgang fehlt\",IF(YEAR(I147)>'Hilfstab AE'!$B$16,0,IF(AND(YEAR(I147)<('Hilfstab AE'!$B$16+1),YEAR(I147)>('Hilfstab AE'!$D$16-1)),\"AE56-60\",\"AE61+\"))))","v":""},"leer ",{"$f":"IF(N147=\"ja\",IF(AND(M147>24.999%,M147<50.001%),'Hilfstab Auswahl SOPÄ'!$J$5/2,IF(M147>50%,'Hilfstab Auswahl SOPÄ'!$J$5,0)),0)","v":{"v":0,"d":"0.000%"}}]
["Auswählen","Auswählen",{"$nulls":5},"Auswählen",null,"Auswählen","Auswählen",{"$nulls":3},"Auswählen","Auswählen",{"$f":"VLOOKUP(O148&P148,CHOOSE({1,2},'Hilfstab Löhne'!$A$3:$A$187&'Hilfstab Löhne'!$B$3:$B$187,'Hilfstab Löhne'!$D$3:$D$187),2,0)","v":0},0,{"v":0,"d":"0.000%"},{"$f":"ROUND(IF(S148=0,0,IF(OR(S148='Hilfstab Auswahl SOPÄ'!$L$6,S148='Hilfstab Auswahl SOPÄ'!$L$8),IF(M148>1,'Hilfstab Auswahl SOPÄ'!$M$6,'Hilfstab Auswahl SOPÄ'!$M$6*M148),IF(OR(S148='Hilfstab Auswahl SOPÄ'!$L$7,S148='Hilfstab Auswahl SOPÄ'!$L$9),IF(M148>1,'Hilfstab Auswahl SOPÄ'!$M$7,'Hilfstab Auswahl SOPÄ'!$M$7*M148),IF(S148='Hilfstab Auswahl SOPÄ'!$L$10,IF(M148>1,'Hilfstab Auswahl SOPÄ'!$M$10,'Hilfstab Auswahl SOPÄ'!$M$10*M148),IF(M148>1,'Hilfstab Auswahl SOPÄ'!$M$11,'Hilfstab Auswahl SOPÄ'!$M$11*M148))))),5)+AE148","v":{"v":0,"d":"0.000%"}},{"$f":"IF(V148=\"ja\",\"ja\",IF(O148=0,0,IF(OR(O148='Hilfstab Auswahl SOPÄ'!$C$7,O148='Hilfstab Auswahl SOPÄ'!$C$6,O148='Hilfstab Auswahl SOPÄ'!$C$13),\"ja\",\"nein\")))","v":"nein"},null,null,{"$f":"IF(OR(O148='Hilfstab Auswahl SOPÄ'!$C$11,O148='Hilfstab Auswahl SOPÄ'!$C$12)*AND(P148>1),\"* genehmigungspflichtige LK\",0)","v":0},null,"",0,{"$f":"VLOOKUP($A148,'Hilfstab Auswahl SOPÄ'!$G$6:$H$9,2,FALSE)","v":"leer"},{"$f":"IF(E148=0,\"\",IF(I148=0,\"Jahrgang fehlt\",IF(YEAR(I148)>'Hilfstab AE'!$B$16,0,IF(AND(YEAR(I148)<('Hilfstab AE'!$B$16+1),YEAR(I148)>('Hilfstab AE'!$D$16-1)),\"AE56-60\",\"AE61+\"))))","v":""},"leer ",{"$f":"IF(N148=\"ja\",IF(AND(M148>24.999%,M148<50.001%),'Hilfstab Auswahl SOPÄ'!$J$5/2,IF(M148>50%,'Hilfstab Auswahl SOPÄ'!$J$5,0)),0)","v":{"v":0,"d":"0.000%"}}]
["Auswählen","Auswählen",{"$nulls":5},"Auswählen",null,"Auswählen","Auswählen",{"$nulls":3},"Auswählen","Auswählen",{"$f":"VLOOKUP(O149&P149,CHOOSE({1,2},'Hilfstab Löhne'!$A$3:$A$187&'Hilfstab Löhne'!$B$3:$B$187,'Hilfstab Löhne'!$D$3:$D$187),2,0)","v":0},{"$f":"IF(Q149=\"ungültige Lohnklasse\",0,M149*Q149)","v":0},{"v":0,"d":"0.000%"},{"$f":"ROUND(IF(S149=0,0,IF(OR(S149='Hilfstab Auswahl SOPÄ'!$L$6,S149='Hilfstab Auswahl SOPÄ'!$L$8),IF(M149>1,'Hilfstab Auswahl SOPÄ'!$M$6,'Hilfstab Auswahl SOPÄ'!$M$6*M149),IF(OR(S149='Hilfstab Auswahl SOPÄ'!$L$7,S149='Hilfstab Auswahl SOPÄ'!$L$9),IF(M149>1,'Hilfstab Auswahl SOPÄ'!$M$7,'Hilfstab Auswahl SOPÄ'!$M$7*M149),IF(S149='Hilfstab Auswahl SOPÄ'!$L$10,IF(M149>1,'Hilfstab Auswahl SOPÄ'!$M$10,'Hilfstab Auswahl SOPÄ'!$M$10*M149),IF(M149>1,'Hilfstab Auswahl SOPÄ'!$M$11,'Hilfstab Auswahl SOPÄ'!$M$11*M149))))),5)+AE149","v":{"v":0,"d":"0.000%"}},{"$f":"IF(V149=\"ja\",\"ja\",IF(O149=0,0,IF(OR(O149='Hilfstab Auswahl SOPÄ'!$C$7,O149='Hilfstab Auswahl SOPÄ'!$C$6,O149='Hilfstab Auswahl SOPÄ'!$C$13),\"ja\",\"nein\")))","v":"nein"},null,null,{"$f":"IF(OR(O149='Hilfstab Auswahl SOPÄ'!$C$11,O149='Hilfstab Auswahl SOPÄ'!$C$12)*AND(P149>1),\"* genehmigungspflichtige LK\",0)","v":0},null,"",{"$f":"SUMIF(Z$17:Z$166,Z149,M$17:M$166)","v":0},{"$f":"VLOOKUP($A149,'Hilfstab Auswahl SOPÄ'!$G$6:$H$9,2,FALSE)","v":"leer"},{"$f":"IF(E149=0,\"\",IF(I149=0,\"Jahrgang fehlt\",IF(YEAR(I149)>'Hilfstab AE'!$B$16,0,IF(AND(YEAR(I149)<('Hilfstab AE'!$B$16+1),YEAR(I149)>('Hilfstab AE'!$D$16-1)),\"AE56-60\",\"AE61+\"))))","v":""},{"$f":"AB149&\" \"&AC149","v":"leer "},{"$f":"IF(N149=\"ja\",IF(AND(M149>24.999%,M149<50.001%),'Hilfstab Auswahl SOPÄ'!$J$5/2,IF(M149>50%,'Hilfstab Auswahl SOPÄ'!$J$5,0)),0)","v":{"v":0,"d":"0.000%"}}]
["Auswählen","Auswählen",{"$nulls":5},"Auswählen",null,"Auswählen","Auswählen",{"$nulls":3},"Auswählen","Auswählen",{"$f":"VLOOKUP(O150&P150,CHOOSE({1,2},'Hilfstab Löhne'!$A$3:$A$187&'Hilfstab Löhne'!$B$3:$B$187,'Hilfstab Löhne'!$D$3:$D$187),2,0)","v":0},0,{"v":0,"d":"0.000%"},{"$f":"ROUND(IF(S150=0,0,IF(OR(S150='Hilfstab Auswahl SOPÄ'!$L$6,S150='Hilfstab Auswahl SOPÄ'!$L$8),IF(M150>1,'Hilfstab Auswahl SOPÄ'!$M$6,'Hilfstab Auswahl SOPÄ'!$M$6*M150),IF(OR(S150='Hilfstab Auswahl SOPÄ'!$L$7,S150='Hilfstab Auswahl SOPÄ'!$L$9),IF(M150>1,'Hilfstab Auswahl SOPÄ'!$M$7,'Hilfstab Auswahl SOPÄ'!$M$7*M150),IF(S150='Hilfstab Auswahl SOPÄ'!$L$10,IF(M150>1,'Hilfstab Auswahl SOPÄ'!$M$10,'Hilfstab Auswahl SOPÄ'!$M$10*M150),IF(M150>1,'Hilfstab Auswahl SOPÄ'!$M$11,'Hilfstab Auswahl SOPÄ'!$M$11*M150))))),5)+AE150","v":{"v":0,"d":"0.000%"}},{"$f":"IF(V150=\"ja\",\"ja\",IF(O150=0,0,IF(OR(O150='Hilfstab Auswahl SOPÄ'!$C$7,O150='Hilfstab Auswahl SOPÄ'!$C$6,O150='Hilfstab Auswahl SOPÄ'!$C$13),\"ja\",\"nein\")))","v":"nein"},null,null,{"$f":"IF(OR(O150='Hilfstab Auswahl SOPÄ'!$C$11,O150='Hilfstab Auswahl SOPÄ'!$C$12)*AND(P150>1),\"* genehmigungspflichtige LK\",0)","v":0},null,"",0,{"$f":"VLOOKUP($A150,'Hilfstab Auswahl SOPÄ'!$G$6:$H$9,2,FALSE)","v":"leer"},{"$f":"IF(E150=0,\"\",IF(I150=0,\"Jahrgang fehlt\",IF(YEAR(I150)>'Hilfstab AE'!$B$16,0,IF(AND(YEAR(I150)<('Hilfstab AE'!$B$16+1),YEAR(I150)>('Hilfstab AE'!$D$16-1)),\"AE56-60\",\"AE61+\"))))","v":""},"leer ",{"$f":"IF(N150=\"ja\",IF(AND(M150>24.999%,M150<50.001%),'Hilfstab Auswahl SOPÄ'!$J$5/2,IF(M150>50%,'Hilfstab Auswahl SOPÄ'!$J$5,0)),0)","v":{"v":0,"d":"0.000%"}}]
["Auswählen","Auswählen",{"$nulls":5},"Auswählen",null,"Auswählen","Auswählen",{"$nulls":3},"Auswählen","Auswählen",{"$f":"VLOOKUP(O151&P151,CHOOSE({1,2},'Hilfstab Löhne'!$A$3:$A$187&'Hilfstab Löhne'!$B$3:$B$187,'Hilfstab Löhne'!$D$3:$D$187),2,0)","v":0},0,{"v":0,"d":"0.000%"},{"$f":"ROUND(IF(S151=0,0,IF(OR(S151='Hilfstab Auswahl SOPÄ'!$L$6,S151='Hilfstab Auswahl SOPÄ'!$L$8),IF(M151>1,'Hilfstab Auswahl SOPÄ'!$M$6,'Hilfstab Auswahl SOPÄ'!$M$6*M151),IF(OR(S151='Hilfstab Auswahl SOPÄ'!$L$7,S151='Hilfstab Auswahl SOPÄ'!$L$9),IF(M151>1,'Hilfstab Auswahl SOPÄ'!$M$7,'Hilfstab Auswahl SOPÄ'!$M$7*M151),IF(S151='Hilfstab Auswahl SOPÄ'!$L$10,IF(M151>1,'Hilfstab Auswahl SOPÄ'!$M$10,'Hilfstab Auswahl SOPÄ'!$M$10*M151),IF(M151>1,'Hilfstab Auswahl SOPÄ'!$M$11,'Hilfstab Auswahl SOPÄ'!$M$11*M151))))),5)+AE151","v":{"v":0,"d":"0.000%"}},{"$f":"IF(V151=\"ja\",\"ja\",IF(O151=0,0,IF(OR(O151='Hilfstab Auswahl SOPÄ'!$C$7,O151='Hilfstab Auswahl SOPÄ'!$C$6,O151='Hilfstab Auswahl SOPÄ'!$C$13),\"ja\",\"nein\")))","v":"nein"},null,null,{"$f":"IF(OR(O151='Hilfstab Auswahl SOPÄ'!$C$11,O151='Hilfstab Auswahl SOPÄ'!$C$12)*AND(P151>1),\"* genehmigungspflichtige LK\",0)","v":0},null,"",0,{"$f":"VLOOKUP($A151,'Hilfstab Auswahl SOPÄ'!$G$6:$H$9,2,FALSE)","v":"leer"},{"$f":"IF(E151=0,\"\",IF(I151=0,\"Jahrgang fehlt\",IF(YEAR(I151)>'Hilfstab AE'!$B$16,0,IF(AND(YEAR(I151)<('Hilfstab AE'!$B$16+1),YEAR(I151)>('Hilfstab AE'!$D$16-1)),\"AE56-60\",\"AE61+\"))))","v":""},"leer ",{"$f":"IF(N151=\"ja\",IF(AND(M151>24.999%,M151<50.001%),'Hilfstab Auswahl SOPÄ'!$J$5/2,IF(M151>50%,'Hilfstab Auswahl SOPÄ'!$J$5,0)),0)","v":{"v":0,"d":"0.000%"}}]
["Auswählen","Auswählen",{"$nulls":5},"Auswählen",null,"Auswählen","Auswählen",{"$nulls":3},"Auswählen","Auswählen",{"$f":"VLOOKUP(O152&P152,CHOOSE({1,2},'Hilfstab Löhne'!$A$3:$A$187&'Hilfstab Löhne'!$B$3:$B$187,'Hilfstab Löhne'!$D$3:$D$187),2,0)","v":0},0,{"v":0,"d":"0.000%"},{"$f":"ROUND(IF(S152=0,0,IF(OR(S152='Hilfstab Auswahl SOPÄ'!$L$6,S152='Hilfstab Auswahl SOPÄ'!$L$8),IF(M152>1,'Hilfstab Auswahl SOPÄ'!$M$6,'Hilfstab Auswahl SOPÄ'!$M$6*M152),IF(OR(S152='Hilfstab Auswahl SOPÄ'!$L$7,S152='Hilfstab Auswahl SOPÄ'!$L$9),IF(M152>1,'Hilfstab Auswahl SOPÄ'!$M$7,'Hilfstab Auswahl SOPÄ'!$M$7*M152),IF(S152='Hilfstab Auswahl SOPÄ'!$L$10,IF(M152>1,'Hilfstab Auswahl SOPÄ'!$M$10,'Hilfstab Auswahl SOPÄ'!$M$10*M152),IF(M152>1,'Hilfstab Auswahl SOPÄ'!$M$11,'Hilfstab Auswahl SOPÄ'!$M$11*M152))))),5)+AE152","v":{"v":0,"d":"0.000%"}},{"$f":"IF(V152=\"ja\",\"ja\",IF(O152=0,0,IF(OR(O152='Hilfstab Auswahl SOPÄ'!$C$7,O152='Hilfstab Auswahl SOPÄ'!$C$6,O152='Hilfstab Auswahl SOPÄ'!$C$13),\"ja\",\"nein\")))","v":"nein"},null,null,{"$f":"IF(OR(O152='Hilfstab Auswahl SOPÄ'!$C$11,O152='Hilfstab Auswahl SOPÄ'!$C$12)*AND(P152>1),\"* genehmigungspflichtige LK\",0)","v":0},null,"",0,{"$f":"VLOOKUP($A152,'Hilfstab Auswahl SOPÄ'!$G$6:$H$9,2,FALSE)","v":"leer"},{"$f":"IF(E152=0,\"\",IF(I152=0,\"Jahrgang fehlt\",IF(YEAR(I152)>'Hilfstab AE'!$B$16,0,IF(AND(YEAR(I152)<('Hilfstab AE'!$B$16+1),YEAR(I152)>('Hilfstab AE'!$D$16-1)),\"AE56-60\",\"AE61+\"))))","v":""},"leer ",{"$f":"IF(N152=\"ja\",IF(AND(M152>24.999%,M152<50.001%),'Hilfstab Auswahl SOPÄ'!$J$5/2,IF(M152>50%,'Hilfstab Auswahl SOPÄ'!$J$5,0)),0)","v":{"v":0,"d":"0.000%"}}]
["Auswählen","Auswählen",{"$nulls":5},"Auswählen",null,"Auswählen","Auswählen",{"$nulls":3},"Auswählen","Auswählen",{"$f":"VLOOKUP(O153&P153,CHOOSE({1,2},'Hilfstab Löhne'!$A$3:$A$187&'Hilfstab Löhne'!$B$3:$B$187,'Hilfstab Löhne'!$D$3:$D$187),2,0)","v":0},0,{"v":0,"d":"0.000%"},{"$f":"ROUND(IF(S153=0,0,IF(OR(S153='Hilfstab Auswahl SOPÄ'!$L$6,S153='Hilfstab Auswahl SOPÄ'!$L$8),IF(M153>1,'Hilfstab Auswahl SOPÄ'!$M$6,'Hilfstab Auswahl SOPÄ'!$M$6*M153),IF(OR(S153='Hilfstab Auswahl SOPÄ'!$L$7,S153='Hilfstab Auswahl SOPÄ'!$L$9),IF(M153>1,'Hilfstab Auswahl SOPÄ'!$M$7,'Hilfstab Auswahl SOPÄ'!$M$7*M153),IF(S153='Hilfstab Auswahl SOPÄ'!$L$10,IF(M153>1,'Hilfstab Auswahl SOPÄ'!$M$10,'Hilfstab Auswahl SOPÄ'!$M$10*M153),IF(M153>1,'Hilfstab Auswahl SOPÄ'!$M$11,'Hilfstab Auswahl SOPÄ'!$M$11*M153))))),5)+AE153","v":{"v":0,"d":"0.000%"}},{"$f":"IF(V153=\"ja\",\"ja\",IF(O153=0,0,IF(OR(O153='Hilfstab Auswahl SOPÄ'!$C$7,O153='Hilfstab Auswahl SOPÄ'!$C$6,O153='Hilfstab Auswahl SOPÄ'!$C$13),\"ja\",\"nein\")))","v":"nein"},null,null,{"$f":"IF(OR(O153='Hilfstab Auswahl SOPÄ'!$C$11,O153='Hilfstab Auswahl SOPÄ'!$C$12)*AND(P153>1),\"* genehmigungspflichtige LK\",0)","v":0},null,"",0,{"$f":"VLOOKUP($A153,'Hilfstab Auswahl SOPÄ'!$G$6:$H$9,2,FALSE)","v":"leer"},{"$f":"IF(E153=0,\"\",IF(I153=0,\"Jahrgang fehlt\",IF(YEAR(I153)>'Hilfstab AE'!$B$16,0,IF(AND(YEAR(I153)<('Hilfstab AE'!$B$16+1),YEAR(I153)>('Hilfstab AE'!$D$16-1)),\"AE56-60\",\"AE61+\"))))","v":""},"leer ",{"$f":"IF(N153=\"ja\",IF(AND(M153>24.999%,M153<50.001%),'Hilfstab Auswahl SOPÄ'!$J$5/2,IF(M153>50%,'Hilfstab Auswahl SOPÄ'!$J$5,0)),0)","v":{"v":0,"d":"0.000%"}}]
["Auswählen","Auswählen",{"$nulls":5},"Auswählen",null,"Auswählen","Auswählen",{"$nulls":3},"Auswählen","Auswählen",{"$f":"VLOOKUP(O154&P154,CHOOSE({1,2},'Hilfstab Löhne'!$A$3:$A$187&'Hilfstab Löhne'!$B$3:$B$187,'Hilfstab Löhne'!$D$3:$D$187),2,0)","v":0},0,{"v":0,"d":"0.000%"},{"$f":"ROUND(IF(S154=0,0,IF(OR(S154='Hilfstab Auswahl SOPÄ'!$L$6,S154='Hilfstab Auswahl SOPÄ'!$L$8),IF(M154>1,'Hilfstab Auswahl SOPÄ'!$M$6,'Hilfstab Auswahl SOPÄ'!$M$6*M154),IF(OR(S154='Hilfstab Auswahl SOPÄ'!$L$7,S154='Hilfstab Auswahl SOPÄ'!$L$9),IF(M154>1,'Hilfstab Auswahl SOPÄ'!$M$7,'Hilfstab Auswahl SOPÄ'!$M$7*M154),IF(S154='Hilfstab Auswahl SOPÄ'!$L$10,IF(M154>1,'Hilfstab Auswahl SOPÄ'!$M$10,'Hilfstab Auswahl SOPÄ'!$M$10*M154),IF(M154>1,'Hilfstab Auswahl SOPÄ'!$M$11,'Hilfstab Auswahl SOPÄ'!$M$11*M154))))),5)+AE154","v":{"v":0,"d":"0.000%"}},{"$f":"IF(V154=\"ja\",\"ja\",IF(O154=0,0,IF(OR(O154='Hilfstab Auswahl SOPÄ'!$C$7,O154='Hilfstab Auswahl SOPÄ'!$C$6,O154='Hilfstab Auswahl SOPÄ'!$C$13),\"ja\",\"nein\")))","v":"nein"},null,null,{"$f":"IF(OR(O154='Hilfstab Auswahl SOPÄ'!$C$11,O154='Hilfstab Auswahl SOPÄ'!$C$12)*AND(P154>1),\"* genehmigungspflichtige LK\",0)","v":0},null,"",0,{"$f":"VLOOKUP($A154,'Hilfstab Auswahl SOPÄ'!$G$6:$H$9,2,FALSE)","v":"leer"},{"$f":"IF(E154=0,\"\",IF(I154=0,\"Jahrgang fehlt\",IF(YEAR(I154)>'Hilfstab AE'!$B$16,0,IF(AND(YEAR(I154)<('Hilfstab AE'!$B$16+1),YEAR(I154)>('Hilfstab AE'!$D$16-1)),\"AE56-60\",\"AE61+\"))))","v":""},"leer ",{"$f":"IF(N154=\"ja\",IF(AND(M154>24.999%,M154<50.001%),'Hilfstab Auswahl SOPÄ'!$J$5/2,IF(M154>50%,'Hilfstab Auswahl SOPÄ'!$J$5,0)),0)","v":{"v":0,"d":"0.000%"}}]
["Auswählen","Auswählen",{"$nulls":5},"Auswählen",null,"Auswählen","Auswählen",{"$nulls":3},"Auswählen","Auswählen",{"$f":"VLOOKUP(O155&P155,CHOOSE({1,2},'Hilfstab Löhne'!$A$3:$A$187&'Hilfstab Löhne'!$B$3:$B$187,'Hilfstab Löhne'!$D$3:$D$187),2,0)","v":0},0,{"v":0,"d":"0.000%"},{"$f":"ROUND(IF(S155=0,0,IF(OR(S155='Hilfstab Auswahl SOPÄ'!$L$6,S155='Hilfstab Auswahl SOPÄ'!$L$8),IF(M155>1,'Hilfstab Auswahl SOPÄ'!$M$6,'Hilfstab Auswahl SOPÄ'!$M$6*M155),IF(OR(S155='Hilfstab Auswahl SOPÄ'!$L$7,S155='Hilfstab Auswahl SOPÄ'!$L$9),IF(M155>1,'Hilfstab Auswahl SOPÄ'!$M$7,'Hilfstab Auswahl SOPÄ'!$M$7*M155),IF(S155='Hilfstab Auswahl SOPÄ'!$L$10,IF(M155>1,'Hilfstab Auswahl SOPÄ'!$M$10,'Hilfstab Auswahl SOPÄ'!$M$10*M155),IF(M155>1,'Hilfstab Auswahl SOPÄ'!$M$11,'Hilfstab Auswahl SOPÄ'!$M$11*M155))))),5)+AE155","v":{"v":0,"d":"0.000%"}},{"$f":"IF(V155=\"ja\",\"ja\",IF(O155=0,0,IF(OR(O155='Hilfstab Auswahl SOPÄ'!$C$7,O155='Hilfstab Auswahl SOPÄ'!$C$6,O155='Hilfstab Auswahl SOPÄ'!$C$13),\"ja\",\"nein\")))","v":"nein"},null,null,{"$f":"IF(OR(O155='Hilfstab Auswahl SOPÄ'!$C$11,O155='Hilfstab Auswahl SOPÄ'!$C$12)*AND(P155>1),\"* genehmigungspflichtige LK\",0)","v":0},null,"",0,{"$f":"VLOOKUP($A155,'Hilfstab Auswahl SOPÄ'!$G$6:$H$9,2,FALSE)","v":"leer"},{"$f":"IF(E155=0,\"\",IF(I155=0,\"Jahrgang fehlt\",IF(YEAR(I155)>'Hilfstab AE'!$B$16,0,IF(AND(YEAR(I155)<('Hilfstab AE'!$B$16+1),YEAR(I155)>('Hilfstab AE'!$D$16-1)),\"AE56-60\",\"AE61+\"))))","v":""},"leer ",{"$f":"IF(N155=\"ja\",IF(AND(M155>24.999%,M155<50.001%),'Hilfstab Auswahl SOPÄ'!$J$5/2,IF(M155>50%,'Hilfstab Auswahl SOPÄ'!$J$5,0)),0)","v":{"v":0,"d":"0.000%"}}]
["Auswählen","Auswählen",{"$nulls":5},"Auswählen",null,"Auswählen","Auswählen",{"$nulls":3},"Auswählen","Auswählen",{"$f":"VLOOKUP(O156&P156,CHOOSE({1,2},'Hilfstab Löhne'!$A$3:$A$187&'Hilfstab Löhne'!$B$3:$B$187,'Hilfstab Löhne'!$D$3:$D$187),2,0)","v":0},0,{"v":0,"d":"0.000%"},{"$f":"ROUND(IF(S156=0,0,IF(OR(S156='Hilfstab Auswahl SOPÄ'!$L$6,S156='Hilfstab Auswahl SOPÄ'!$L$8),IF(M156>1,'Hilfstab Auswahl SOPÄ'!$M$6,'Hilfstab Auswahl SOPÄ'!$M$6*M156),IF(OR(S156='Hilfstab Auswahl SOPÄ'!$L$7,S156='Hilfstab Auswahl SOPÄ'!$L$9),IF(M156>1,'Hilfstab Auswahl SOPÄ'!$M$7,'Hilfstab Auswahl SOPÄ'!$M$7*M156),IF(S156='Hilfstab Auswahl SOPÄ'!$L$10,IF(M156>1,'Hilfstab Auswahl SOPÄ'!$M$10,'Hilfstab Auswahl SOPÄ'!$M$10*M156),IF(M156>1,'Hilfstab Auswahl SOPÄ'!$M$11,'Hilfstab Auswahl SOPÄ'!$M$11*M156))))),5)+AE156","v":{"v":0,"d":"0.000%"}},{"$f":"IF(V156=\"ja\",\"ja\",IF(O156=0,0,IF(OR(O156='Hilfstab Auswahl SOPÄ'!$C$7,O156='Hilfstab Auswahl SOPÄ'!$C$6,O156='Hilfstab Auswahl SOPÄ'!$C$13),\"ja\",\"nein\")))","v":"nein"},null,null,{"$f":"IF(OR(O156='Hilfstab Auswahl SOPÄ'!$C$11,O156='Hilfstab Auswahl SOPÄ'!$C$12)*AND(P156>1),\"* genehmigungspflichtige LK\",0)","v":0},null,"",0,{"$f":"VLOOKUP($A156,'Hilfstab Auswahl SOPÄ'!$G$6:$H$9,2,FALSE)","v":"leer"},{"$f":"IF(E156=0,\"\",IF(I156=0,\"Jahrgang fehlt\",IF(YEAR(I156)>'Hilfstab AE'!$B$16,0,IF(AND(YEAR(I156)<('Hilfstab AE'!$B$16+1),YEAR(I156)>('Hilfstab AE'!$D$16-1)),\"AE56-60\",\"AE61+\"))))","v":""},"leer ",{"$f":"IF(N156=\"ja\",IF(AND(M156>24.999%,M156<50.001%),'Hilfstab Auswahl SOPÄ'!$J$5/2,IF(M156>50%,'Hilfstab Auswahl SOPÄ'!$J$5,0)),0)","v":{"v":0,"d":"0.000%"}}]
["Auswählen","Auswählen",{"$nulls":5},"Auswählen",null,"Auswählen","Auswählen",{"$nulls":3},"Auswählen","Auswählen",{"$f":"VLOOKUP(O157&P157,CHOOSE({1,2},'Hilfstab Löhne'!$A$3:$A$187&'Hilfstab Löhne'!$B$3:$B$187,'Hilfstab Löhne'!$D$3:$D$187),2,0)","v":0},0,{"v":0,"d":"0.000%"},{"$f":"ROUND(IF(S157=0,0,IF(OR(S157='Hilfstab Auswahl SOPÄ'!$L$6,S157='Hilfstab Auswahl SOPÄ'!$L$8),IF(M157>1,'Hilfstab Auswahl SOPÄ'!$M$6,'Hilfstab Auswahl SOPÄ'!$M$6*M157),IF(OR(S157='Hilfstab Auswahl SOPÄ'!$L$7,S157='Hilfstab Auswahl SOPÄ'!$L$9),IF(M157>1,'Hilfstab Auswahl SOPÄ'!$M$7,'Hilfstab Auswahl SOPÄ'!$M$7*M157),IF(S157='Hilfstab Auswahl SOPÄ'!$L$10,IF(M157>1,'Hilfstab Auswahl SOPÄ'!$M$10,'Hilfstab Auswahl SOPÄ'!$M$10*M157),IF(M157>1,'Hilfstab Auswahl SOPÄ'!$M$11,'Hilfstab Auswahl SOPÄ'!$M$11*M157))))),5)+AE157","v":{"v":0,"d":"0.000%"}},{"$f":"IF(V157=\"ja\",\"ja\",IF(O157=0,0,IF(OR(O157='Hilfstab Auswahl SOPÄ'!$C$7,O157='Hilfstab Auswahl SOPÄ'!$C$6,O157='Hilfstab Auswahl SOPÄ'!$C$13),\"ja\",\"nein\")))","v":"nein"},null,null,{"$f":"IF(OR(O157='Hilfstab Auswahl SOPÄ'!$C$11,O157='Hilfstab Auswahl SOPÄ'!$C$12)*AND(P157>1),\"* genehmigungspflichtige LK\",0)","v":0},null,"",0,{"$f":"VLOOKUP($A157,'Hilfstab Auswahl SOPÄ'!$G$6:$H$9,2,FALSE)","v":"leer"},{"$f":"IF(E157=0,\"\",IF(I157=0,\"Jahrgang fehlt\",IF(YEAR(I157)>'Hilfstab AE'!$B$16,0,IF(AND(YEAR(I157)<('Hilfstab AE'!$B$16+1),YEAR(I157)>('Hilfstab AE'!$D$16-1)),\"AE56-60\",\"AE61+\"))))","v":""},"leer ",{"$f":"IF(N157=\"ja\",IF(AND(M157>24.999%,M157<50.001%),'Hilfstab Auswahl SOPÄ'!$J$5/2,IF(M157>50%,'Hilfstab Auswahl SOPÄ'!$J$5,0)),0)","v":{"v":0,"d":"0.000%"}}]
["Auswählen","Auswählen",{"$nulls":5},"Auswählen",null,"Auswählen","Auswählen",{"$nulls":3},"Auswählen","Auswählen",{"$f":"VLOOKUP(O158&P158,CHOOSE({1,2},'Hilfstab Löhne'!$A$3:$A$187&'Hilfstab Löhne'!$B$3:$B$187,'Hilfstab Löhne'!$D$3:$D$187),2,0)","v":0},0,{"v":0,"d":"0.000%"},{"$f":"ROUND(IF(S158=0,0,IF(OR(S158='Hilfstab Auswahl SOPÄ'!$L$6,S158='Hilfstab Auswahl SOPÄ'!$L$8),IF(M158>1,'Hilfstab Auswahl SOPÄ'!$M$6,'Hilfstab Auswahl SOPÄ'!$M$6*M158),IF(OR(S158='Hilfstab Auswahl SOPÄ'!$L$7,S158='Hilfstab Auswahl SOPÄ'!$L$9),IF(M158>1,'Hilfstab Auswahl SOPÄ'!$M$7,'Hilfstab Auswahl SOPÄ'!$M$7*M158),IF(S158='Hilfstab Auswahl SOPÄ'!$L$10,IF(M158>1,'Hilfstab Auswahl SOPÄ'!$M$10,'Hilfstab Auswahl SOPÄ'!$M$10*M158),IF(M158>1,'Hilfstab Auswahl SOPÄ'!$M$11,'Hilfstab Auswahl SOPÄ'!$M$11*M158))))),5)+AE158","v":{"v":0,"d":"0.000%"}},{"$f":"IF(V158=\"ja\",\"ja\",IF(O158=0,0,IF(OR(O158='Hilfstab Auswahl SOPÄ'!$C$7,O158='Hilfstab Auswahl SOPÄ'!$C$6,O158='Hilfstab Auswahl SOPÄ'!$C$13),\"ja\",\"nein\")))","v":"nein"},null,null,{"$f":"IF(OR(O158='Hilfstab Auswahl SOPÄ'!$C$11,O158='Hilfstab Auswahl SOPÄ'!$C$12)*AND(P158>1),\"* genehmigungspflichtige LK\",0)","v":0},null,"",0,{"$f":"VLOOKUP($A158,'Hilfstab Auswahl SOPÄ'!$G$6:$H$9,2,FALSE)","v":"leer"},{"$f":"IF(E158=0,\"\",IF(I158=0,\"Jahrgang fehlt\",IF(YEAR(I158)>'Hilfstab AE'!$B$16,0,IF(AND(YEAR(I158)<('Hilfstab AE'!$B$16+1),YEAR(I158)>('Hilfstab AE'!$D$16-1)),\"AE56-60\",\"AE61+\"))))","v":""},"leer ",{"$f":"IF(N158=\"ja\",IF(AND(M158>24.999%,M158<50.001%),'Hilfstab Auswahl SOPÄ'!$J$5/2,IF(M158>50%,'Hilfstab Auswahl SOPÄ'!$J$5,0)),0)","v":{"v":0,"d":"0.000%"}}]
["Auswählen","Auswählen",{"$nulls":5},"Auswählen",null,"Auswählen","Auswählen",{"$nulls":3},"Auswählen","Auswählen",{"$f":"VLOOKUP(O159&P159,CHOOSE({1,2},'Hilfstab Löhne'!$A$3:$A$187&'Hilfstab Löhne'!$B$3:$B$187,'Hilfstab Löhne'!$D$3:$D$187),2,0)","v":0},0,{"v":0,"d":"0.000%"},{"$f":"ROUND(IF(S159=0,0,IF(OR(S159='Hilfstab Auswahl SOPÄ'!$L$6,S159='Hilfstab Auswahl SOPÄ'!$L$8),IF(M159>1,'Hilfstab Auswahl SOPÄ'!$M$6,'Hilfstab Auswahl SOPÄ'!$M$6*M159),IF(OR(S159='Hilfstab Auswahl SOPÄ'!$L$7,S159='Hilfstab Auswahl SOPÄ'!$L$9),IF(M159>1,'Hilfstab Auswahl SOPÄ'!$M$7,'Hilfstab Auswahl SOPÄ'!$M$7*M159),IF(S159='Hilfstab Auswahl SOPÄ'!$L$10,IF(M159>1,'Hilfstab Auswahl SOPÄ'!$M$10,'Hilfstab Auswahl SOPÄ'!$M$10*M159),IF(M159>1,'Hilfstab Auswahl SOPÄ'!$M$11,'Hilfstab Auswahl SOPÄ'!$M$11*M159))))),5)+AE159","v":{"v":0,"d":"0.000%"}},{"$f":"IF(V159=\"ja\",\"ja\",IF(O159=0,0,IF(OR(O159='Hilfstab Auswahl SOPÄ'!$C$7,O159='Hilfstab Auswahl SOPÄ'!$C$6,O159='Hilfstab Auswahl SOPÄ'!$C$13),\"ja\",\"nein\")))","v":"nein"},null,null,{"$f":"IF(OR(O159='Hilfstab Auswahl SOPÄ'!$C$11,O159='Hilfstab Auswahl SOPÄ'!$C$12)*AND(P159>1),\"* genehmigungspflichtige LK\",0)","v":0},null,"",0,{"$f":"VLOOKUP($A159,'Hilfstab Auswahl SOPÄ'!$G$6:$H$9,2,FALSE)","v":"leer"},{"$f":"IF(E159=0,\"\",IF(I159=0,\"Jahrgang fehlt\",IF(YEAR(I159)>'Hilfstab AE'!$B$16,0,IF(AND(YEAR(I159)<('Hilfstab AE'!$B$16+1),YEAR(I159)>('Hilfstab AE'!$D$16-1)),\"AE56-60\",\"AE61+\"))))","v":""},"leer ",{"$f":"IF(N159=\"ja\",IF(AND(M159>24.999%,M159<50.001%),'Hilfstab Auswahl SOPÄ'!$J$5/2,IF(M159>50%,'Hilfstab Auswahl SOPÄ'!$J$5,0)),0)","v":{"v":0,"d":"0.000%"}}]
["Auswählen","Auswählen",{"$nulls":5},"Auswählen",null,"Auswählen","Auswählen",{"$nulls":3},"Auswählen","Auswählen",{"$f":"VLOOKUP(O160&P160,CHOOSE({1,2},'Hilfstab Löhne'!$A$3:$A$187&'Hilfstab Löhne'!$B$3:$B$187,'Hilfstab Löhne'!$D$3:$D$187),2,0)","v":0},0,{"v":0,"d":"0.000%"},{"$f":"ROUND(IF(S160=0,0,IF(OR(S160='Hilfstab Auswahl SOPÄ'!$L$6,S160='Hilfstab Auswahl SOPÄ'!$L$8),IF(M160>1,'Hilfstab Auswahl SOPÄ'!$M$6,'Hilfstab Auswahl SOPÄ'!$M$6*M160),IF(OR(S160='Hilfstab Auswahl SOPÄ'!$L$7,S160='Hilfstab Auswahl SOPÄ'!$L$9),IF(M160>1,'Hilfstab Auswahl SOPÄ'!$M$7,'Hilfstab Auswahl SOPÄ'!$M$7*M160),IF(S160='Hilfstab Auswahl SOPÄ'!$L$10,IF(M160>1,'Hilfstab Auswahl SOPÄ'!$M$10,'Hilfstab Auswahl SOPÄ'!$M$10*M160),IF(M160>1,'Hilfstab Auswahl SOPÄ'!$M$11,'Hilfstab Auswahl SOPÄ'!$M$11*M160))))),5)+AE160","v":{"v":0,"d":"0.000%"}},{"$f":"IF(V160=\"ja\",\"ja\",IF(O160=0,0,IF(OR(O160='Hilfstab Auswahl SOPÄ'!$C$7,O160='Hilfstab Auswahl SOPÄ'!$C$6,O160='Hilfstab Auswahl SOPÄ'!$C$13),\"ja\",\"nein\")))","v":"nein"},null,null,{"$f":"IF(OR(O160='Hilfstab Auswahl SOPÄ'!$C$11,O160='Hilfstab Auswahl SOPÄ'!$C$12)*AND(P160>1),\"* genehmigungspflichtige LK\",0)","v":0},null,"",0,{"$f":"VLOOKUP($A160,'Hilfstab Auswahl SOPÄ'!$G$6:$H$9,2,FALSE)","v":"leer"},{"$f":"IF(E160=0,\"\",IF(I160=0,\"Jahrgang fehlt\",IF(YEAR(I160)>'Hilfstab AE'!$B$16,0,IF(AND(YEAR(I160)<('Hilfstab AE'!$B$16+1),YEAR(I160)>('Hilfstab AE'!$D$16-1)),\"AE56-60\",\"AE61+\"))))","v":""},"leer ",{"$f":"IF(N160=\"ja\",IF(AND(M160>24.999%,M160<50.001%),'Hilfstab Auswahl SOPÄ'!$J$5/2,IF(M160>50%,'Hilfstab Auswahl SOPÄ'!$J$5,0)),0)","v":{"v":0,"d":"0.000%"}}]
["Auswählen","Auswählen",{"$nulls":5},"Auswählen",null,"Auswählen","Auswählen",{"$nulls":3},"Auswählen","Auswählen",{"$f":"VLOOKUP(O161&P161,CHOOSE({1,2},'Hilfstab Löhne'!$A$3:$A$187&'Hilfstab Löhne'!$B$3:$B$187,'Hilfstab Löhne'!$D$3:$D$187),2,0)","v":0},0,{"v":0,"d":"0.000%"},{"$f":"ROUND(IF(S161=0,0,IF(OR(S161='Hilfstab Auswahl SOPÄ'!$L$6,S161='Hilfstab Auswahl SOPÄ'!$L$8),IF(M161>1,'Hilfstab Auswahl SOPÄ'!$M$6,'Hilfstab Auswahl SOPÄ'!$M$6*M161),IF(OR(S161='Hilfstab Auswahl SOPÄ'!$L$7,S161='Hilfstab Auswahl SOPÄ'!$L$9),IF(M161>1,'Hilfstab Auswahl SOPÄ'!$M$7,'Hilfstab Auswahl SOPÄ'!$M$7*M161),IF(S161='Hilfstab Auswahl SOPÄ'!$L$10,IF(M161>1,'Hilfstab Auswahl SOPÄ'!$M$10,'Hilfstab Auswahl SOPÄ'!$M$10*M161),IF(M161>1,'Hilfstab Auswahl SOPÄ'!$M$11,'Hilfstab Auswahl SOPÄ'!$M$11*M161))))),5)+AE161","v":{"v":0,"d":"0.000%"}},{"$f":"IF(V161=\"ja\",\"ja\",IF(O161=0,0,IF(OR(O161='Hilfstab Auswahl SOPÄ'!$C$7,O161='Hilfstab Auswahl SOPÄ'!$C$6,O161='Hilfstab Auswahl SOPÄ'!$C$13),\"ja\",\"nein\")))","v":"nein"},null,null,{"$f":"IF(OR(O161='Hilfstab Auswahl SOPÄ'!$C$11,O161='Hilfstab Auswahl SOPÄ'!$C$12)*AND(P161>1),\"* genehmigungspflichtige LK\",0)","v":0},null,"",0,{"$f":"VLOOKUP($A161,'Hilfstab Auswahl SOPÄ'!$G$6:$H$9,2,FALSE)","v":"leer"},{"$f":"IF(E161=0,\"\",IF(I161=0,\"Jahrgang fehlt\",IF(YEAR(I161)>'Hilfstab AE'!$B$16,0,IF(AND(YEAR(I161)<('Hilfstab AE'!$B$16+1),YEAR(I161)>('Hilfstab AE'!$D$16-1)),\"AE56-60\",\"AE61+\"))))","v":""},"leer ",{"$f":"IF(N161=\"ja\",IF(AND(M161>24.999%,M161<50.001%),'Hilfstab Auswahl SOPÄ'!$J$5/2,IF(M161>50%,'Hilfstab Auswahl SOPÄ'!$J$5,0)),0)","v":{"v":0,"d":"0.000%"}}]
["Auswählen","Auswählen",{"$nulls":5},"Auswählen",null,"Auswählen","Auswählen",{"$nulls":3},"Auswählen","Auswählen",{"$f":"VLOOKUP(O162&P162,CHOOSE({1,2},'Hilfstab Löhne'!$A$3:$A$187&'Hilfstab Löhne'!$B$3:$B$187,'Hilfstab Löhne'!$D$3:$D$187),2,0)","v":0},0,{"v":0,"d":"0.000%"},{"$f":"ROUND(IF(S162=0,0,IF(OR(S162='Hilfstab Auswahl SOPÄ'!$L$6,S162='Hilfstab Auswahl SOPÄ'!$L$8),IF(M162>1,'Hilfstab Auswahl SOPÄ'!$M$6,'Hilfstab Auswahl SOPÄ'!$M$6*M162),IF(OR(S162='Hilfstab Auswahl SOPÄ'!$L$7,S162='Hilfstab Auswahl SOPÄ'!$L$9),IF(M162>1,'Hilfstab Auswahl SOPÄ'!$M$7,'Hilfstab Auswahl SOPÄ'!$M$7*M162),IF(S162='Hilfstab Auswahl SOPÄ'!$L$10,IF(M162>1,'Hilfstab Auswahl SOPÄ'!$M$10,'Hilfstab Auswahl SOPÄ'!$M$10*M162),IF(M162>1,'Hilfstab Auswahl SOPÄ'!$M$11,'Hilfstab Auswahl SOPÄ'!$M$11*M162))))),5)+AE162","v":{"v":0,"d":"0.000%"}},{"$f":"IF(V162=\"ja\",\"ja\",IF(O162=0,0,IF(OR(O162='Hilfstab Auswahl SOPÄ'!$C$7,O162='Hilfstab Auswahl SOPÄ'!$C$6,O162='Hilfstab Auswahl SOPÄ'!$C$13),\"ja\",\"nein\")))","v":"nein"},null,null,{"$f":"IF(OR(O162='Hilfstab Auswahl SOPÄ'!$C$11,O162='Hilfstab Auswahl SOPÄ'!$C$12)*AND(P162>1),\"* genehmigungspflichtige LK\",0)","v":0},null,"",0,{"$f":"VLOOKUP($A162,'Hilfstab Auswahl SOPÄ'!$G$6:$H$9,2,FALSE)","v":"leer"},{"$f":"IF(E162=0,\"\",IF(I162=0,\"Jahrgang fehlt\",IF(YEAR(I162)>'Hilfstab AE'!$B$16,0,IF(AND(YEAR(I162)<('Hilfstab AE'!$B$16+1),YEAR(I162)>('Hilfstab AE'!$D$16-1)),\"AE56-60\",\"AE61+\"))))","v":""},"leer ",{"$f":"IF(N162=\"ja\",IF(AND(M162>24.999%,M162<50.001%),'Hilfstab Auswahl SOPÄ'!$J$5/2,IF(M162>50%,'Hilfstab Auswahl SOPÄ'!$J$5,0)),0)","v":{"v":0,"d":"0.000%"}}]
["Auswählen","Auswählen",{"$nulls":5},"Auswählen",null,"Auswählen","Auswählen",{"$nulls":3},"Auswählen","Auswählen",{"$f":"VLOOKUP(O163&P163,CHOOSE({1,2},'Hilfstab Löhne'!$A$3:$A$187&'Hilfstab Löhne'!$B$3:$B$187,'Hilfstab Löhne'!$D$3:$D$187),2,0)","v":0},0,{"v":0,"d":"0.000%"},{"$f":"ROUND(IF(S163=0,0,IF(OR(S163='Hilfstab Auswahl SOPÄ'!$L$6,S163='Hilfstab Auswahl SOPÄ'!$L$8),IF(M163>1,'Hilfstab Auswahl SOPÄ'!$M$6,'Hilfstab Auswahl SOPÄ'!$M$6*M163),IF(OR(S163='Hilfstab Auswahl SOPÄ'!$L$7,S163='Hilfstab Auswahl SOPÄ'!$L$9),IF(M163>1,'Hilfstab Auswahl SOPÄ'!$M$7,'Hilfstab Auswahl SOPÄ'!$M$7*M163),IF(S163='Hilfstab Auswahl SOPÄ'!$L$10,IF(M163>1,'Hilfstab Auswahl SOPÄ'!$M$10,'Hilfstab Auswahl SOPÄ'!$M$10*M163),IF(M163>1,'Hilfstab Auswahl SOPÄ'!$M$11,'Hilfstab Auswahl SOPÄ'!$M$11*M163))))),5)+AE163","v":{"v":0,"d":"0.000%"}},{"$f":"IF(V163=\"ja\",\"ja\",IF(O163=0,0,IF(OR(O163='Hilfstab Auswahl SOPÄ'!$C$7,O163='Hilfstab Auswahl SOPÄ'!$C$6,O163='Hilfstab Auswahl SOPÄ'!$C$13),\"ja\",\"nein\")))","v":"nein"},null,null,{"$f":"IF(OR(O163='Hilfstab Auswahl SOPÄ'!$C$11,O163='Hilfstab Auswahl SOPÄ'!$C$12)*AND(P163>1),\"* genehmigungspflichtige LK\",0)","v":0},null,"",0,{"$f":"VLOOKUP($A163,'Hilfstab Auswahl SOPÄ'!$G$6:$H$9,2,FALSE)","v":"leer"},{"$f":"IF(E163=0,\"\",IF(I163=0,\"Jahrgang fehlt\",IF(YEAR(I163)>'Hilfstab AE'!$B$16,0,IF(AND(YEAR(I163)<('Hilfstab AE'!$B$16+1),YEAR(I163)>('Hilfstab AE'!$D$16-1)),\"AE56-60\",\"AE61+\"))))","v":""},"leer ",{"$f":"IF(N163=\"ja\",IF(AND(M163>24.999%,M163<50.001%),'Hilfstab Auswahl SOPÄ'!$J$5/2,IF(M163>50%,'Hilfstab Auswahl SOPÄ'!$J$5,0)),0)","v":{"v":0,"d":"0.000%"}}]
["Auswählen","Auswählen",{"$nulls":5},"Auswählen",null,"Auswählen","Auswählen",{"$nulls":3},"Auswählen","Auswählen",{"$f":"VLOOKUP(O164&P164,CHOOSE({1,2},'Hilfstab Löhne'!$A$3:$A$187&'Hilfstab Löhne'!$B$3:$B$187,'Hilfstab Löhne'!$D$3:$D$187),2,0)","v":0},0,{"v":0,"d":"0.000%"},{"$f":"ROUND(IF(S164=0,0,IF(OR(S164='Hilfstab Auswahl SOPÄ'!$L$6,S164='Hilfstab Auswahl SOPÄ'!$L$8),IF(M164>1,'Hilfstab Auswahl SOPÄ'!$M$6,'Hilfstab Auswahl SOPÄ'!$M$6*M164),IF(OR(S164='Hilfstab Auswahl SOPÄ'!$L$7,S164='Hilfstab Auswahl SOPÄ'!$L$9),IF(M164>1,'Hilfstab Auswahl SOPÄ'!$M$7,'Hilfstab Auswahl SOPÄ'!$M$7*M164),IF(S164='Hilfstab Auswahl SOPÄ'!$L$10,IF(M164>1,'Hilfstab Auswahl SOPÄ'!$M$10,'Hilfstab Auswahl SOPÄ'!$M$10*M164),IF(M164>1,'Hilfstab Auswahl SOPÄ'!$M$11,'Hilfstab Auswahl SOPÄ'!$M$11*M164))))),5)+AE164","v":{"v":0,"d":"0.000%"}},{"$f":"IF(V164=\"ja\",\"ja\",IF(O164=0,0,IF(OR(O164='Hilfstab Auswahl SOPÄ'!$C$7,O164='Hilfstab Auswahl SOPÄ'!$C$6,O164='Hilfstab Auswahl SOPÄ'!$C$13),\"ja\",\"nein\")))","v":"nein"},null,null,{"$f":"IF(OR(O164='Hilfstab Auswahl SOPÄ'!$C$11,O164='Hilfstab Auswahl SOPÄ'!$C$12)*AND(P164>1),\"* genehmigungspflichtige LK\",0)","v":0},null,"",0,{"$f":"VLOOKUP($A164,'Hilfstab Auswahl SOPÄ'!$G$6:$H$9,2,FALSE)","v":"leer"},{"$f":"IF(E164=0,\"\",IF(I164=0,\"Jahrgang fehlt\",IF(YEAR(I164)>'Hilfstab AE'!$B$16,0,IF(AND(YEAR(I164)<('Hilfstab AE'!$B$16+1),YEAR(I164)>('Hilfstab AE'!$D$16-1)),\"AE56-60\",\"AE61+\"))))","v":""},"leer ",{"$f":"IF(N164=\"ja\",IF(AND(M164>24.999%,M164<50.001%),'Hilfstab Auswahl SOPÄ'!$J$5/2,IF(M164>50%,'Hilfstab Auswahl SOPÄ'!$J$5,0)),0)","v":{"v":0,"d":"0.000%"}}]
["Auswählen","Auswählen",{"$nulls":5},"Auswählen",null,"Auswählen","Auswählen",{"$nulls":3},"Auswählen","Auswählen",{"$f":"VLOOKUP(O165&P165,CHOOSE({1,2},'Hilfstab Löhne'!$A$3:$A$187&'Hilfstab Löhne'!$B$3:$B$187,'Hilfstab Löhne'!$D$3:$D$187),2,0)","v":0},0,{"v":0,"d":"0.000%"},{"$f":"ROUND(IF(S165=0,0,IF(OR(S165='Hilfstab Auswahl SOPÄ'!$L$6,S165='Hilfstab Auswahl SOPÄ'!$L$8),IF(M165>1,'Hilfstab Auswahl SOPÄ'!$M$6,'Hilfstab Auswahl SOPÄ'!$M$6*M165),IF(OR(S165='Hilfstab Auswahl SOPÄ'!$L$7,S165='Hilfstab Auswahl SOPÄ'!$L$9),IF(M165>1,'Hilfstab Auswahl SOPÄ'!$M$7,'Hilfstab Auswahl SOPÄ'!$M$7*M165),IF(S165='Hilfstab Auswahl SOPÄ'!$L$10,IF(M165>1,'Hilfstab Auswahl SOPÄ'!$M$10,'Hilfstab Auswahl SOPÄ'!$M$10*M165),IF(M165>1,'Hilfstab Auswahl SOPÄ'!$M$11,'Hilfstab Auswahl SOPÄ'!$M$11*M165))))),5)+AE165","v":{"v":0,"d":"0.000%"}},{"$f":"IF(V165=\"ja\",\"ja\",IF(O165=0,0,IF(OR(O165='Hilfstab Auswahl SOPÄ'!$C$7,O165='Hilfstab Auswahl SOPÄ'!$C$6,O165='Hilfstab Auswahl SOPÄ'!$C$13),\"ja\",\"nein\")))","v":"nein"},null,null,{"$f":"IF(OR(O165='Hilfstab Auswahl SOPÄ'!$C$11,O165='Hilfstab Auswahl SOPÄ'!$C$12)*AND(P165>1),\"* genehmigungspflichtige LK\",0)","v":0},null,"",0,{"$f":"VLOOKUP($A165,'Hilfstab Auswahl SOPÄ'!$G$6:$H$9,2,FALSE)","v":"leer"},{"$f":"IF(E165=0,\"\",IF(I165=0,\"Jahrgang fehlt\",IF(YEAR(I165)>'Hilfstab AE'!$B$16,0,IF(AND(YEAR(I165)<('Hilfstab AE'!$B$16+1),YEAR(I165)>('Hilfstab AE'!$D$16-1)),\"AE56-60\",\"AE61+\"))))","v":""},"leer ",{"$f":"IF(N165=\"ja\",IF(AND(M165>24.999%,M165<50.001%),'Hilfstab Auswahl SOPÄ'!$J$5/2,IF(M165>50%,'Hilfstab Auswahl SOPÄ'!$J$5,0)),0)","v":{"v":0,"d":"0.000%"}}]
["Auswählen","Auswählen",{"$nulls":5},"Auswählen",null,"Auswählen","Auswählen",{"$nulls":3},"Auswählen","Auswählen",{"$f":"VLOOKUP(O166&P166,CHOOSE({1,2},'Hilfstab Löhne'!$A$3:$A$187&'Hilfstab Löhne'!$B$3:$B$187,'Hilfstab Löhne'!$D$3:$D$187),2,0)","v":0},0,{"v":0,"d":"0.000%"},{"$f":"ROUND(IF(S166=0,0,IF(OR(S166='Hilfstab Auswahl SOPÄ'!$L$6,S166='Hilfstab Auswahl SOPÄ'!$L$8),IF(M166>1,'Hilfstab Auswahl SOPÄ'!$M$6,'Hilfstab Auswahl SOPÄ'!$M$6*M166),IF(OR(S166='Hilfstab Auswahl SOPÄ'!$L$7,S166='Hilfstab Auswahl SOPÄ'!$L$9),IF(M166>1,'Hilfstab Auswahl SOPÄ'!$M$7,'Hilfstab Auswahl SOPÄ'!$M$7*M166),IF(S166='Hilfstab Auswahl SOPÄ'!$L$10,IF(M166>1,'Hilfstab Auswahl SOPÄ'!$M$10,'Hilfstab Auswahl SOPÄ'!$M$10*M166),IF(M166>1,'Hilfstab Auswahl SOPÄ'!$M$11,'Hilfstab Auswahl SOPÄ'!$M$11*M166))))),5)+AE166","v":{"v":0,"d":"0.000%"}},{"$f":"IF(V166=\"ja\",\"ja\",IF(O166=0,0,IF(OR(O166='Hilfstab Auswahl SOPÄ'!$C$7,O166='Hilfstab Auswahl SOPÄ'!$C$6,O166='Hilfstab Auswahl SOPÄ'!$C$13),\"ja\",\"nein\")))","v":"nein"},null,null,{"$f":"IF(OR(O166='Hilfstab Auswahl SOPÄ'!$C$11,O166='Hilfstab Auswahl SOPÄ'!$C$12)*AND(P166>1),\"* genehmigungspflichtige LK\",0)","v":0},null,"",0,{"$f":"VLOOKUP($A166,'Hilfstab Auswahl SOPÄ'!$G$6:$H$9,2,FALSE)","v":"leer"},{"$f":"IF(E166=0,\"\",IF(I166=0,\"Jahrgang fehlt\",IF(YEAR(I166)>'Hilfstab AE'!$B$16,0,IF(AND(YEAR(I166)<('Hilfstab AE'!$B$16+1),YEAR(I166)>('Hilfstab AE'!$D$16-1)),\"AE56-60\",\"AE61+\"))))","v":""},"leer ",{"$f":"IF(N166=\"ja\",IF(AND(M166>24.999%,M166<50.001%),'Hilfstab Auswahl SOPÄ'!$J$5/2,IF(M166>50%,'Hilfstab Auswahl SOPÄ'!$J$5,0)),0)","v":{"v":0,"d":"0.000%"}}]

{"sheet":"C","index":3,"n_rows":168,"n_cols":30,"rows_kept":168,"merged":[[14,0,15,0],[14,1,15,1],[14,2,15,2],[14,3,15,3],[14,4,15,4],[14,5,15,5],[14,10,15,10],[14,11,15,11],[14,12,15,12],[14,13,15,13]]}
["Kalenderjahr",{"$f":"+Zusammenzug!B4","v":2024},{"$f":"Zusammenzug!B6","v":0}]
["Teil C: Pensum des angestellten Personals (Grundlage für die Berechnung des Elements A. Schulische Förderung)",{"$nulls":28},"ja"]
["Weiteres Personal (Assistenz, Praktikantinnen, Lernende)"]
[]
["Hinweise zum Ausfüllen"]
["Eingabefelder sind gelb hinterlegt, ","Auswahlfenster dunkelgelb."]
["Einstufung der effektiven Pensen im Pensenplan",null,null,"Abgrenzung bei Jahreslohn",null,"Anrechnung"]
["Assistenz Lohn höher als BVO Klasse 9  Maximum ",null,null,">",{"$f":"+E9","v":{"v":66982.5,"d":"Fr. 66,982.50"}},{"v":1,"d":"100%"}]
["Assistenz bis BVO Klasse 9 Maximum ",null,null,"≤",{"v":66982.5,"d":"Fr. 66,982.50"},{"v":0.5,"d":"50%"}]
["Praktikum bis BVO Klasse 3 Maximum",null,null,"≤",{"v":47702.2,"d":"Fr. 47,702.20"},{"v":0.25,"d":"25%"}]
["FABE Erstausbildung (Maximum Lohn 3. Lehrjahr) *",null,null,"≤",{"$f":"1370*13","v":{"v":17810,"d":"Fr. 17,810.00"}},"0%","*Ausschliesslich für Auszubildende in dreijähriger Erstausbildung wird kein Pensum angerechnet."]
["Andere",null,null,">",{"$f":"+E9","v":{"v":66982.5,"d":"Fr. 66,982.50"}},{"v":1,"d":"100%"}]
[]
[]
["Funktion","Eintritt\nJahr","Name / Vorname","Jahr-\ngang","Diplome","Einstufung","Pensum","Jahres-","Pensum","Bruttolohn","Qualifi-ziertes Pensum","Ausbil-dung SHP","Bemerkungen","Kontrolle",null,"Maximum"]
[{"$nulls":6},"effektiv","bruttolohn","anrechenbar","bei 100%",{"$nulls":5},{"$f":"+'Hilfstab Löhne'!D80","v":{"v":142293.15,"d":"Fr. 142,293.15"}}]
[null,null,"Total",{"$nulls":3},{"$f":"SUM(G19:G168)","v":{"v":0,"d":"0.0%"}},{"$f":"SUM(H19:H168)","v":{"v":0,"d":"Fr. 0.00"}},{"$f":"SUM(I19:I168)","v":{"v":0,"d":"0.0%"}},null,{"$f":"SUM(K19:K168)","v":{"v":0,"d":"0.0%"}},null,{"$f":"SUMIF(L19:L168,\"ja\",H19:H168)","v":{"v":0,"d":"Fr. 0.00"}}]
[null,null,"Davon sonderschulspezifisch qualifiziertes Personal",{"$nulls":3},{"$f":"+K17","v":{"v":0,"d":"0.0%"}}]
[{"$nulls":5},"Auswählen",null,null,{"$f":"IF(G19=\"\",0,G19*VLOOKUP(F19,'Hilfstab Auswahl SOPÄ'!$O$6:$P$11,2,FALSE))","v":{"v":0,"d":"0.0%"}},{"$f":"IF(G19=0,0,H19/G19*100%)","v":0},{"$f":"IF(L19=\"ja\",G19,0)","v":{"v":0,"d":"0.0%"}},null,null,{"$f":"IF(J19>P19,\"Lohn > Maximaleinstufung\",\"\")","v":""},null,{"$f":"IF(F19='Hilfstab Auswahl SOPÄ'!$O$8,ROUNDUP($E$9,0),IF(F19='Hilfstab Auswahl SOPÄ'!$O$9,ROUNDUP($E$10,0),IF(F19='Hilfstab Auswahl SOPÄ'!$O$10,ROUNDUP($E$11,0),$P$16)))","v":{"v":142293.15,"d":"Fr. 142,293.15"}}]
[{"$nulls":5},"Auswählen",null,null,{"$f":"IF(G20=\"\",0,G20*VLOOKUP(F20,'Hilfstab Auswahl SOPÄ'!$O$6:$P$11,2,FALSE))","v":{"v":0,"d":"0.0%"}},0,{"$f":"IF(L20=\"ja\",G20,0)","v":{"v":0,"d":"0.0%"}},null,null,"",null,{"$f":"IF(F20='Hilfstab Auswahl SOPÄ'!$O$8,ROUNDUP($E$9,0),IF(F20='Hilfstab Auswahl SOPÄ'!$O$9,ROUNDUP($E$10,0),IF(F20='Hilfstab Auswahl SOPÄ'!$O$10,ROUNDUP($E$11,0),$P$16)))","v":{"v":142293.15,"d":"Fr. 142,293.15"}}]
[{"$nulls":5},"Auswählen",null,null,{"$f":"IF(G21=\"\",0,G21*VLOOKUP(F21,'Hilfstab Auswahl SOPÄ'!$O$6:$P$11,2,FALSE))","v":{"v":0,"d":"0.0%"}},0,{"v":0,"d":"0.0%"},null,null,"",null,{"$f":"IF(F21='Hilfstab Auswahl SOPÄ'!$O$8,ROUNDUP($E$9,0),IF(F21='Hilfstab Auswahl SOPÄ'!$O$9,ROUNDUP($E$10,0),IF(F21='Hilfstab Auswahl SOPÄ'!$O$10,ROUNDUP($E$11,0),$P$16)))","v":{"v":142293.15,"d":"Fr. 142,293.15"}}]
[{"$nulls":5},"Auswählen",null,null,{"$f":"IF(G22=\"\",0,G22*VLOOKUP(F22,'Hilfstab Auswahl SOPÄ'!$O$6:$P$11,2,FALSE))","v":{"v":0,"d":"0.0%"}},0,{"v":0,"d":"0.0%"},null,null,"",null,{"$f":"IF(F22='Hilfstab Auswahl SOPÄ'!$O$8,ROUNDUP($E$9,0),IF(F22='Hilfstab Auswahl SOPÄ'!$O$9,ROUNDUP($E$10,0),IF(F22='Hilfstab Auswahl SOPÄ'!$O$10,ROUNDUP($E$11,0),$P$16)))","v":{"v":142293.15,"d":"Fr. 142,293.15"}}]
[{"$nulls":5},"Auswählen",null,null,{"$f":"IF(G23=\"\",0,G23*VLOOKUP(F23,'Hilfstab Auswahl SOPÄ'!$O$6:$P$11,2,FALSE))","v":{"v":0,"d":"0.0%"}},0,{"v":0,"d":"0.0%"},null,null,"",null,{"$f":"IF(F23='Hilfstab Auswahl SOPÄ'!$O$8,ROUNDUP($E$9,0),IF(F23='Hilfstab Auswahl SOPÄ'!$O$9,ROUNDUP($E$10,0),IF(F23='Hilfstab Auswahl SOPÄ'!$O$10,ROUNDUP($E$11,0),$P$16)))","v":{"v":142293.15,"d":"Fr. 142,293.15"}}]
[{"$nulls":5},"Auswählen",null,null,{"$f":"IF(G24=\"\",0,G24*VLOOKUP(F24,'Hilfstab Auswahl SOPÄ'!$O$6:$P$11,2,FALSE))","v":{"v":0,"d":"0.0%"}},0,{"v":0,"d":"0.0%"},null,null,"",null,{"$f":"IF(F24='Hilfstab Auswahl SOPÄ'!$O$8,ROUNDUP($E$9,0),IF(F24='Hilfstab Auswahl SOPÄ'!$O$9,ROUNDUP($E$10,0),IF(F24='Hilfstab Auswahl SOPÄ'!$O$10,ROUNDUP($E$11,0),$P$16)))","v":{"v":142293.15,"d":"Fr. 142,293.15"}}]
[{"$nulls":5},"Auswählen",null,null,{"$f":"IF(G25=\"\",0,G25*VLOOKUP(F25,'Hilfstab Auswahl SOPÄ'!$O$6:$P$11,2,FALSE))","v":{"v":0,"d":"0.0%"}},0,{"v":0,"d":"0.0%"},null,null,"",null,{"$f":"IF(F25='Hilfstab Auswahl SOPÄ'!$O$8,ROUNDUP($E$9,0),IF(F25='Hilfstab Auswahl SOPÄ'!$O$9,ROUNDUP($E$10,0),IF(F25='Hilfstab Auswahl SOPÄ'!$O$10,ROUNDUP($E$11,0),$P$16)))","v":{"v":142293.15,"d":"Fr. 142,293.15"}}]
[{"$nulls":5},"Auswählen",null,null,{"$f":"IF(G26=\"\",0,G26*VLOOKUP(F26,'Hilfstab Auswahl SOPÄ'!$O$6:$P$11,2,FALSE))","v":{"v":0,"d":"0.0%"}},0,{"v":0,"d":"0.0%"},null,null,"",null,{"$f":"IF(F26='Hilfstab Auswahl SOPÄ'!$O$8,ROUNDUP($E$9,0),IF(F26='Hilfstab Auswahl SOPÄ'!$O$9,ROUNDUP($E$10,0),IF(F26='Hilfstab Auswahl SOPÄ'!$O$10,ROUNDUP($E$11,0),$P$16)))","v":{"v":142293.15,"d":"Fr. 142,293.15"}}]
[{"$nulls":5},"Auswählen",null,null,{"$f":"IF(G27=\"\",0,G27*VLOOKUP(F27,'Hilfstab Auswahl SOPÄ'!$O$6:$P$11,2,FALSE))","v":{"v":0,"d":"0.0%"}},0,{"v":0,"d":"0.0%"},null,null,"",null,{"$f":"IF(F27='Hilfstab Auswahl SOPÄ'!$O$8,ROUNDUP($E$9,0),IF(F27='Hilfstab Auswahl SOPÄ'!$O$9,ROUNDUP($E$10,0),IF(F27='Hilfstab Auswahl SOPÄ'!$O$10,ROUNDUP($E$11,0),$P$16)))","v":{"v":142293.15,"d":"Fr. 142,293.15"}}]
[{"$nulls":5},"Auswählen",null,null,{"$f":"IF(G28=\"\",0,G28*VLOOKUP(F28,'Hilfstab Auswahl SOPÄ'!$O$6:$P$11,2,FALSE))","v":{"v":0,"d":"0.0%"}},0,{"v":0,"d":"0.0%"},null,null,"",null,{"$f":"IF(F28='Hilfstab Auswahl SOPÄ'!$O$8,ROUNDUP($E$9,0),IF(F28='Hilfstab Auswahl SOPÄ'!$O$9,ROUNDUP($E$10,0),IF(F28='Hilfstab Auswahl SOPÄ'!$O$10,ROUNDUP($E$11,0),$P$16)))","v":{"v":142293.15,"d":"Fr. 142,293.15"}}]
[{"$nulls":5},"Auswählen",null,null,{"$f":"IF(G29=\"\",0,G29*VLOOKUP(F29,'Hilfstab Auswahl SOPÄ'!$O$6:$P$11,2,FALSE))","v":{"v":0,"d":"0.0%"}},0,{"v":0,"d":"0.0%"},null,null,"",null,{"$f":"IF(F29='Hilfstab Auswahl SOPÄ'!$O$8,ROUNDUP($E$9,0),IF(F29='Hilfstab Auswahl SOPÄ'!$O$9,ROUNDUP($E$10,0),IF(F29='Hilfstab Auswahl SOPÄ'!$O$10,ROUNDUP($E$11,0),$P$16)))","v":{"v":142293.15,"d":"Fr. 142,293.15"}}]
[{"$nulls":5},"Auswählen",null,null,{"$f":"IF(G30=\"\",0,G30*VLOOKUP(F30,'Hilfstab Auswahl SOPÄ'!$O$6:$P$11,2,FALSE))","v":{"v":0,"d":"0.0%"}},0,{"v":0,"d":"0.0%"},null,null,"",null,{"$f":"IF(F30='Hilfstab Auswahl SOPÄ'!$O$8,ROUNDUP($E$9,0),IF(F30='Hilfstab Auswahl SOPÄ'!$O$9,ROUNDUP($E$10,0),IF(F30='Hilfstab Auswahl SOPÄ'!$O$10,ROUNDUP($E$11,0),$P$16)))","v":{"v":142293.15,"d":"Fr. 142,293.15"}}]
[{"$nulls":5},"Auswählen",null,null,{"$f":"IF(G31=\"\",0,G31*VLOOKUP(F31,'Hilfstab Auswahl SOPÄ'!$O$6:$P$11,2,FALSE))","v":{"v":0,"d":"0.0%"}},0,{"v":0,"d":"0.0%"},null,null,"",null,{"$f":"IF(F31='Hilfstab Auswahl SOPÄ'!$O$8,ROUNDUP($E$9,0),IF(F31='Hilfstab Auswahl SOPÄ'!$O$9,ROUNDUP($E$10,0),IF(F31='Hilfstab Auswahl SOPÄ'!$O$10,ROUNDUP($E$11,0),$P$16)))","v":{"v":142293.15,"d":"Fr. 142,293.15"}}]
[{"$nulls":5},"Auswählen",null,null,{"$f":"IF(G32=\"\",0,G32*VLOOKUP(F32,'Hilfstab Auswahl SOPÄ'!$O$6:$P$11,2,FALSE))","v":{"v":0,"d":"0.0%"}},0,{"v":0,"d":"0.0%"},null,null,"",null,{"$f":"IF(F32='Hilfstab Auswahl SOPÄ'!$O$8,ROUNDUP($E$9,0),IF(F32='Hilfstab Auswahl SOPÄ'!$O$9,ROUNDUP($E$10,0),IF(F32='Hilfstab Auswahl SOPÄ'!$O$10,ROUNDUP($E$11,0),$P$16)))","v":{"v":142293.15,"d":"Fr. 142,293.15"}}]
[{"$nulls":5},"Auswählen",null,null,{"$f":"IF(G33=\"\",0,G33*VLOOKUP(F33,'Hilfstab Auswahl SOPÄ'!$O$6:$P$11,2,FALSE))","v":{"v":0,"d":"0.0%"}},0,{"v":0,"d":"0.0%"},null,null,"",null,{"$f":"IF(F33='Hilfstab Auswahl SOPÄ'!$O$8,ROUNDUP($E$9,0),IF(F33='Hilfstab Auswahl SOPÄ'!$O$9,ROUNDUP($E$10,0),IF(F33='Hilfstab Auswahl SOPÄ'!$O$10,ROUNDUP($E$11,0),$P$16)))","v":{"v":142293.15,"d":"Fr. 142,293.15"}}]
[{"$nulls":5},"Auswählen",null,null,{"$f":"IF(G34=\"\",0,G34*VLOOKUP(F34,'Hilfstab Auswahl SOPÄ'!$O$6:$P$11,2,FALSE))","v":{"v":0,"d":"0.0%"}},0,{"v":0,"d":"0.0%"},null,null,{"$f":"IF(J34>P34,\"Lohn > Maximaleinstufung\",\"\")","v":""},null,{"$f":"IF(F34='Hilfstab Auswahl SOPÄ'!$O$8,ROUNDUP($E$9,0),IF(F34='Hilfstab Auswahl SOPÄ'!$O$9,ROUNDUP($E$10,0),IF(F34='Hilfstab Auswahl SOPÄ'!$O$10,ROUNDUP($E$11,0),$P$16)))","v":{"v":142293.15,"d":"Fr. 142,293.15"}}]
[{"$nulls":5},"Auswählen",null,null,{"$f":"IF(G35=\"\",0,G35*VLOOKUP(F35,'Hilfstab Auswahl SOPÄ'!$O$6:$P$11,2,FALSE))","v":{"v":0,"d":"0.0%"}},0,{"v":0,"d":"0.0%"},null,null,"",null,{"$f":"IF(F35='Hilfstab Auswahl SOPÄ'!$O$8,ROUNDUP($E$9,0),IF(F35='Hilfstab Auswahl SOPÄ'!$O$9,ROUNDUP($E$10,0),IF(F35='Hilfstab Auswahl SOPÄ'!$O$10,ROUNDUP($E$11,0),$P$16)))","v":{"v":142293.15,"d":"Fr. 142,293.15"}}]
[{"$nulls":5},"Auswählen",null,null,{"$f":"IF(G36=\"\",0,G36*VLOOKUP(F36,'Hilfstab Auswahl SOPÄ'!$O$6:$P$11,2,FALSE))","v":{"v":0,"d":"0.0%"}},0,{"v":0,"d":"0.0%"},null,null,"",null,{"$f":"IF(F36='Hilfstab Auswahl SOPÄ'!$O$8,ROUNDUP($E$9,0),IF(F36='Hilfstab Auswahl SOPÄ'!$O$9,ROUNDUP($E$10,0),IF(F36='Hilfstab Auswahl SOPÄ'!$O$10,ROUNDUP($E$11,0),$P$16)))","v":{"v":142293.15,"d":"Fr. 142,293.15"}}]
[{"$nulls":5},"Auswählen",null,null,{"$f":"IF(G37=\"\",0,G37*VLOOKUP(F37,'Hilfstab Auswahl SOPÄ'!$O$6:$P$11,2,FALSE))","v":{"v":0,"d":"0.0%"}},0,{"v":0,"d":"0.0%"},null,null,"",null,{"$f":"IF(F37='Hilfstab Auswahl SOPÄ'!$O$8,ROUNDUP($E$9,0),IF(F37='Hilfstab Auswahl SOPÄ'!$O$9,ROUNDUP($E$10,0),IF(F37='Hilfstab Auswahl SOPÄ'!$O$10,ROUNDUP($E$11,0),$P$16)))","v":{"v":142293.15,"d":"Fr. 142,293.15"}}]
[{"$nulls":5},"Auswählen",null,null,{"$f":"IF(G38=\"\",0,G38*VLOOKUP(F38,'Hilfstab Auswahl SOPÄ'!$O$6:$P$11,2,FALSE))","v":{"v":0,"d":"0.0%"}},0,{"v":0,"d":"0.0%"},null,null,"",null,{"$f":"IF(F38='Hilfstab Auswahl SOPÄ'!$O$8,ROUNDUP($E$9,0),IF(F38='Hilfstab Auswahl SOPÄ'!$O$9,ROUNDUP($E$10,0),IF(F38='Hilfstab Auswahl SOPÄ'!$O$10,ROUNDUP($E$11,0),$P$16)))","v":{"v":142293.15,"d":"Fr. 142,293.15"}}]
[{"$nulls":5},"Auswählen",null,null,{"$f":"IF(G39=\"\",0,G39*VLOOKUP(F39,'Hilfstab Auswahl SOPÄ'!$O$6:$P$11,2,FALSE))","v":{"v":0,"d":"0.0%"}},0,{"v":0,"d":"0.0%"},null,null,"",null,{"$f":"IF(F39='Hilfstab Auswahl SOPÄ'!$O$8,ROUNDUP($E$9,0),IF(F39='Hilfstab Auswahl SOPÄ'!$O$9,ROUNDUP($E$10,0),IF(F39='Hilfstab Auswahl SOPÄ'!$O$10,ROUNDUP($E$11,0),$P$16)))","v":{"v":142293.15,"d":"Fr. 142,293.15"}}]
[{"$nulls":5},"Auswählen",null,null,{"$f":"IF(G40=\"\",0,G40*VLOOKUP(F40,'Hilfstab Auswahl SOPÄ'!$O$6:$P$11,2,FALSE))","v":{"v":0,"d":"0.0%"}},0,{"v":0,"d":"0.0%"},null,null,"",null,{"$f":"IF(F40='Hilfstab Auswahl SOPÄ'!$O$8,ROUNDUP($E$9,0),IF(F40='Hilfstab Auswahl SOPÄ'!$O$9,ROUNDUP($E$10,0),IF(F40='Hilfstab Auswahl SOPÄ'!$O$10,ROUNDUP($E$11,0),$P$16)))","v":{"v":142293.15,"d":"Fr. 142,293.15"}}]
[{"$nulls":5},"Auswählen",null,null,{"$f":"IF(G41=\"\",0,G41*VLOOKUP(F41,'Hilfstab Auswahl SOPÄ'!$O$6:$P$11,2,FALSE))","v":{"v":0,"d":"0.0%"}},0,{"v":0,"d":"0.0%"},null,null,"",null,{"$f":"IF(F41='Hilfstab Auswahl SOPÄ'!$O$8,ROUNDUP($E$9,0),IF(F41='Hilfstab Auswahl SOPÄ'!$O$9,ROUNDUP($E$10,0),IF(F41='Hilfstab Auswahl SOPÄ'!$O$10,ROUNDUP($E$11,0),$P$16)))","v":{"v":142293.15,"d":"Fr. 142,293.15"}}]
[{"$nulls":5},"Auswählen",null,null,{"$f":"IF(G42=\"\",0,G42*VLOOKUP(F42,'Hilfstab Auswahl SOPÄ'!$O$6:$P$11,2,FALSE))","v":{"v":0,"d":"0.0%"}},0,{"v":0,"d":"0.0%"},null,null,"",null,{"$f":"IF(F42='Hilfstab Auswahl SOPÄ'!$O$8,ROUNDUP($E$9,0),IF(F42='Hilfstab Auswahl SOPÄ'!$O$9,ROUNDUP($E$10,0),IF(F42='Hilfstab Auswahl SOPÄ'!$O$10,ROUNDUP($E$11,0),$P$16)))","v":{"v":142293.15,"d":"Fr. 142,293.15"}}]
[{"$nulls":5},"Auswählen",null,null,{"$f":"IF(G43=\"\",0,G43*VLOOKUP(F43,'Hilfstab Auswahl SOPÄ'!$O$6:$P$11,2,FALSE))","v":{"v":0,"d":"0.0%"}},0,{"v":0,"d":"0.0%"},null,null,"",null,{"$f":"IF(F43='Hilfstab Auswahl SOPÄ'!$O$8,ROUNDUP($E$9,0),IF(F43='Hilfstab Auswahl SOPÄ'!$O$9,ROUNDUP($E$10,0),IF(F43='Hilfstab Auswahl SOPÄ'!$O$10,ROUNDUP($E$11,0),$P$16)))","v":{"v":142293.15,"d":"Fr. 142,293.15"}}]
[{"$nulls":5},"Auswählen",null,null,{"$f":"IF(G44=\"\",0,G44*VLOOKUP(F44,'Hilfstab Auswahl SOPÄ'!$O$6:$P$11,2,FALSE))","v":{"v":0,"d":"0.0%"}},0,{"v":0,"d":"0.0%"},null,null,"",null,{"$f":"IF(F44='Hilfstab Auswahl SOPÄ'!$O$8,ROUNDUP($E$9,0),IF(F44='Hilfstab Auswahl SOPÄ'!$O$9,ROUNDUP($E$10,0),IF(F44='Hilfstab Auswahl SOPÄ'!$O$10,ROUNDUP($E$11,0),$P$16)))","v":{"v":142293.15,"d":"Fr. 142,293.15"}}]
[{"$nulls":5},"Auswählen",null,null,{"$f":"IF(G45=\"\",0,G45*VLOOKUP(F45,'Hilfstab Auswahl SOPÄ'!$O$6:$P$11,2,FALSE))","v":{"v":0,"d":"0.0%"}},0,{"v":0,"d":"0.0%"},null,null,"",null,{"$f":"IF(F45='Hilfstab Auswahl SOPÄ'!$O$8,ROUNDUP($E$9,0),IF(F45='Hilfstab Auswahl SOPÄ'!$O$9,ROUNDUP($E$10,0),IF(F45='Hilfstab Auswahl SOPÄ'!$O$10,ROUNDUP($E$11,0),$P$16)))","v":{"v":142293.15,"d":"Fr. 142,293.15"}}]
[{"$nulls":5},"Auswählen",null,null,{"$f":"IF(G46=\"\",0,G46*VLOOKUP(F46,'Hilfstab Auswahl SOPÄ'!$O$6:$P$11,2,FALSE))","v":{"v":0,"d":"0.0%"}},0,{"v":0,"d":"0.0%"},null,null,"",null,{"$f":"IF(F46='Hilfstab Auswahl SOPÄ'!$O$8,ROUNDUP($E$9,0),IF(F46='Hilfstab Auswahl SOPÄ'!$O$9,ROUNDUP($E$10,0),IF(F46='Hilfstab Auswahl SOPÄ'!$O$10,ROUNDUP($E$11,0),$P$16)))","v":{"v":142293.15,"d":"Fr. 142,293.15"}}]
[{"$nulls":5},"Auswählen",null,null,{"$f":"IF(G47=\"\",0,G47*VLOOKUP(F47,'Hilfstab Auswahl SOPÄ'!$O$6:$P$11,2,FALSE))","v":{"v":0,"d":"0.0%"}},0,{"v":0,"d":"0.0%"},null,null,"",null,{"$f":"IF(F47='Hilfstab Auswahl SOPÄ'!$O$8,ROUNDUP($E$9,0),IF(F47='Hilfstab Auswahl SOPÄ'!$O$9,ROUNDUP($E$10,0),IF(F47='Hilfstab Auswahl SOPÄ'!$O$10,ROUNDUP($E$11,0),$P$16)))","v":{"v":142293.15,"d":"Fr. 142,293.15"}}]
[{"$nulls":5},"Auswählen",null,null,{"$f":"IF(G48=\"\",0,G48*VLOOKUP(F48,'Hilfstab Auswahl SOPÄ'!$O$6:$P$11,2,FALSE))","v":{"v":0,"d":"0.0%"}},0,{"v":0,"d":"0.0%"},null,null,"",null,{"$f":"IF(F48='Hilfstab Auswahl SOPÄ'!$O$8,ROUNDUP($E$9,0),IF(F48='Hilfstab Auswahl SOPÄ'!$O$9,ROUNDUP($E$10,0),IF(F48='Hilfstab Auswahl SOPÄ'!$O$10,ROUNDUP($E$11,0),$P$16)))","v":{"v":142293.15,"d":"Fr. 142,293.15"}}]
[{"$nulls":5},"Auswählen",null,null,{"$f":"IF(G49=\"\",0,G49*VLOOKUP(F49,'Hilfstab Auswahl SOPÄ'!$O$6:$P$11,2,FALSE))","v":{"v":0,"d":"0.0%"}},0,{"v":0,"d":"0.0%"},null,null,"",null,{"$f":"IF(F49='Hilfstab Auswahl SOPÄ'!$O$8,ROUNDUP($E$9,0),IF(F49='Hilfstab Auswahl SOPÄ'!$O$9,ROUNDUP($E$10,0),IF(F49='Hilfstab Auswahl SOPÄ'!$O$10,ROUNDUP($E$11,0),$P$16)))","v":{"v":142293.15,"d":"Fr. 142,293.15"}}]
[{"$nulls":5},"Auswählen",null,null,{"$f":"IF(G50=\"\",0,G50*VLOOKUP(F50,'Hilfstab Auswahl SOPÄ'!$O$6:$P$11,2,FALSE))","v":{"v":0,"d":"0.0%"}},0,{"v":0,"d":"0.0%"},null,null,"",null,{"$f":"IF(F50='Hilfstab Auswahl SOPÄ'!$O$8,ROUNDUP($E$9,0),IF(F50='Hilfstab Auswahl SOPÄ'!$O$9,ROUNDUP($E$10,0),IF(F50='Hilfstab Auswahl SOPÄ'!$O$10,ROUNDUP($E$11,0),$P$16)))","v":{"v":142293.15,"d":"Fr. 142,293.15"}}]
[{"$nulls":5},"Auswählen",null,null,{"$f":"IF(G51=\"\",0,G51*VLOOKUP(F51,'Hilfstab Auswahl SOPÄ'!$O$6:$P$11,2,FALSE))","v":{"v":0,"d":"0.0%"}},0,{"v":0,"d":"0.0%"},null,null,"",null,{"$f":"IF(F51='Hilfstab Auswahl SOPÄ'!$O$8,ROUNDUP($E$9,0),IF(F51='Hilfstab Auswahl SOPÄ'!$O$9,ROUNDUP($E$10,0),IF(F51='Hilfstab Auswahl SOPÄ'!$O$10,ROUNDUP($E$11,0),$P$16)))","v":{"v":142293.15,"d":"Fr. 142,293.15"}}]
[{"$nulls":5},"Auswählen",null,null,{"$f":"IF(G52=\"\",0,G52*VLOOKUP(F52,'Hilfstab Auswahl SOPÄ'!$O$6:$P$11,2,FALSE))","v":{"v":0,"d":"0.0%"}},0,{"v":0,"d":"0.0%"},null,null,"",null,{"$f":"IF(F52='Hilfstab Auswahl SOPÄ'!$O$8,ROUNDUP($E$9,0),IF(F52='Hilfstab Auswahl SOPÄ'!$O$9,ROUNDUP($E$10,0),IF(F52='Hilfstab Auswahl SOPÄ'!$O$10,ROUNDUP($E$11,0),$P$16)))","v":{"v":142293.15,"d":"Fr. 142,293.15"}}]
[{"$nulls":5},"Auswählen",null,null,{"$f":"IF(G53=\"\",0,G53*VLOOKUP(F53,'Hilfstab Auswahl SOPÄ'!$O$6:$P$11,2,FALSE))","v":{"v":0,"d":"0.0%"}},0,{"v":0,"d":"0.0%"},null,null,"",null,{"$f":"IF(F53='Hilfstab Auswahl SOPÄ'!$O$8,ROUNDUP($E$9,0),IF(F53='Hilfstab Auswahl SOPÄ'!$O$9,ROUNDUP($E$10,0),IF(F53='Hilfstab Auswahl SOPÄ'!$O$10,ROUNDUP($E$11,0),$P$16)))","v":{"v":142293.15,"d":"Fr. 142,293.15"}}]
[{"$nulls":5},"Auswählen",null,null,{"$f":"IF(G54=\"\",0,G54*VLOOKUP(F54,'Hilfstab Auswahl SOPÄ'!$O$6:$P$11,2,FALSE))","v":{"v":0,"d":"0.0%"}},0,{"v":0,"d":"0.0%"},null,null,"",null,{"$f":"IF(F54='Hilfstab Auswahl SOPÄ'!$O$8,ROUNDUP($E$9,0),IF(F54='Hilfstab Auswahl SOPÄ'!$O$9,ROUNDUP($E$10,0),IF(F54='Hilfstab Auswahl SOPÄ'!$O$10,ROUNDUP($E$11,0),$P$16)))","v":{"v":142293.15,"d":"Fr. 142,293.15"}}]
[{"$nulls":5},"Auswählen",null,null,{"$f":"IF(G55=\"\",0,G55*VLOOKUP(F55,'Hilfstab Auswahl SOPÄ'!$O$6:$P$11,2,FALSE))","v":{"v":0,"d":"0.0%"}},0,{"v":0,"d":"0.0%"},null,null,"",null,{"$f":"IF(F55='Hilfstab Auswahl SOPÄ'!$O$8,ROUNDUP($E$9,0),IF(F55='Hilfstab Auswahl SOPÄ'!$O$9,ROUNDUP($E$10,0),IF(F55='Hilfstab Auswahl SOPÄ'!$O$10,ROUNDUP($E$11,0),$P$16)))","v":{"v":142293.15,"d":"Fr. 142,293.15"}}]
[{"$nulls":5},"Auswählen",null,null,{"$f":"IF(G56=\"\",0,G56*VLOOKUP(F56,'Hilfstab Auswahl SOPÄ'!$O$6:$P$11,2,FALSE))","v":{"v":0,"d":"0.0%"}},0,{"v":0,"d":"0.0%"},null,null,"",null,{"$f":"IF(F56='Hilfstab Auswahl SOPÄ'!$O$8,ROUNDUP($E$9,0),IF(F56='Hilfstab Auswahl SOPÄ'!$O$9,ROUNDUP($E$10,0),IF(F56='Hilfstab Auswahl SOPÄ'!$O$10,ROUNDUP($E$11,0),$P$16)))","v":{"v":142293.15,"d":"Fr. 142,293.15"}}]
[{"$nulls":5},"Auswählen",null,null,{"$f":"IF(G57=\"\",0,G57*VLOOKUP(F57,'Hilfstab Auswahl SOPÄ'!$O$6:$P$11,2,FALSE))","v":{"v":0,"d":"0.0%"}},0,{"v":0,"d":"0.0%"},null,null,"",null,{"$f":"IF(F57='Hilfstab Auswahl SOPÄ'!$O$8,ROUNDUP($E$9,0),IF(F57='Hilfstab Auswahl SOPÄ'!$O$9,ROUNDUP($E$10,0),IF(F57='Hilfstab Auswahl SOPÄ'!$O$10,ROUNDUP($E$11,0),$P$16)))","v":{"v":142293.15,"d":"Fr. 142,293.15"}}]
[{"$nulls":5},"Auswählen",null,null,{"$f":"IF(G58=\"\",0,G58*VLOOKUP(F58,'Hilfstab Auswahl SOPÄ'!$O$6:$P$11,2,FALSE))","v":{"v":0,"d":"0.0%"}},0,{"v":0,"d":"0.0%"},null,null,"",null,{"$f":"IF(F58='Hilfstab Auswahl SOPÄ'!$O$8,ROUNDUP($E$9,0),IF(F58='Hilfstab Auswahl SOPÄ'!$O$9,ROUNDUP($E$10,0),IF(F58='Hilfstab Auswahl SOPÄ'!$O$10,ROUNDUP($E$11,0),$P$16)))","v":{"v":142293.15,"d":"Fr. 142,293.15"}}]
[{"$nulls":5},"Auswählen",null,null,{"$f":"IF(G59=\"\",0,G59*VLOOKUP(F59,'Hilfstab Auswahl SOPÄ'!$O$6:$P$11,2,FALSE))","v":{"v":0,"d":"0.0%"}},0,{"v":0,"d":"0.0%"},null,null,"",null,{"$f":"IF(F59='Hilfstab Auswahl SOPÄ'!$O$8,ROUNDUP($E$9,0),IF(F59='Hilfstab Auswahl SOPÄ'!$O$9,ROUNDUP($E$10,0),IF(F59='Hilfstab Auswahl SOPÄ'!$O$10,ROUNDUP($E$11,0),$P$16)))","v":{"v":142293.15,"d":"Fr. 142,293.15"}}]
[{"$nulls":5},"Auswählen",null,null,{"$f":"IF(G60=\"\",0,G60*VLOOKUP(F60,'Hilfstab Auswahl SOPÄ'!$O$6:$P$11,2,FALSE))","v":{"v":0,"d":"0.0%"}},0,{"v":0,"d":"0.0%"},null,null,"",null,{"$f":"IF(F60='Hilfstab Auswahl SOPÄ'!$O$8,ROUNDUP($E$9,0),IF(F60='Hilfstab Auswahl SOPÄ'!$O$9,ROUNDUP($E$10,0),IF(F60='Hilfstab Auswahl SOPÄ'!$O$10,ROUNDUP($E$11,0),$P$16)))","v":{"v":142293.15,"d":"Fr. 142,293.15"}}]
[{"$nulls":5},"Auswählen",null,null,{"$f":"IF(G61=\"\",0,G61*VLOOKUP(F61,'Hilfstab Auswahl SOPÄ'!$O$6:$P$11,2,FALSE))","v":{"v":0,"d":"0.0%"}},0,{"v":0,"d":"0.0%"},null,null,"",null,{"$f":"IF(F61='Hilfstab Auswahl SOPÄ'!$O$8,ROUNDUP($E$9,0),IF(F61='Hilfstab Auswahl SOPÄ'!$O$9,ROUNDUP($E$10,0),IF(F61='Hilfstab Auswahl SOPÄ'!$O$10,ROUNDUP($E$11,0),$P$16)))","v":{"v":142293.15,"d":"Fr. 142,293.15"}}]
[{"$nulls":5},"Auswählen",null,null,{"$f":"IF(G62=\"\",0,G62*VLOOKUP(F62,'Hilfstab Auswahl SOPÄ'!$O$6:$P$11,2,FALSE))","v":{"v":0,"d":"0.0%"}},0,{"v":0,"d":"0.0%"},null,null,"",null,{"$f":"IF(F62='Hilfstab Auswahl SOPÄ'!$O$8,ROUNDUP($E$9,0),IF(F62='Hilfstab Auswahl SOPÄ'!$O$9,ROUNDUP($E$10,0),IF(F62='Hilfstab Auswahl SOPÄ'!$O$10,ROUNDUP($E$11,0),$P$16)))","v":{"v":142293.15,"d":"Fr. 142,293.15"}}]
[{"$nulls":5},"Auswählen",null,null,{"$f":"IF(G63=\"\",0,G63*VLOOKUP(F63,'Hilfstab Auswahl SOPÄ'!$O$6:$P$11,2,FALSE))","v":{"v":0,"d":"0.0%"}},0,{"v":0,"d":"0.0%"},null,null,"",null,{"$f":"IF(F63='Hilfstab Auswahl SOPÄ'!$O$8,ROUNDUP($E$9,0),IF(F63='Hilfstab Auswahl SOPÄ'!$O$9,ROUNDUP($E$10,0),IF(F63='Hilfstab Auswahl SOPÄ'!$O$10,ROUNDUP($E$11,0),$P$16)))","v":{"v":142293.15,"d":"Fr. 142,293.15"}}]
[{"$nulls":5},"Auswählen",null,null,{"$f":"IF(G64=\"\",0,G64*VLOOKUP(F64,'Hilfstab Auswahl SOPÄ'!$O$6:$P$11,2,FALSE))","v":{"v":0,"d":"0.0%"}},0,{"v":0,"d":"0.0%"},null,null,"",null,{"$f":"IF(F64='Hilfstab Auswahl SOPÄ'!$O$8,ROUNDUP($E$9,0),IF(F64='Hilfstab Auswahl SOPÄ'!$O$9,ROUNDUP($E$10,0),IF(F64='Hilfstab Auswahl SOPÄ'!$O$10,ROUNDUP($E$11,0),$P$16)))","v":{"v":142293.15,"d":"Fr. 142,293.15"}}]
[{"$nulls":5},"Auswählen",null,null,{"$f":"IF(G65=\"\",0,G65*VLOOKUP(F65,'Hilfstab Auswahl SOPÄ'!$O$6:$P$11,2,FALSE))","v":{"v":0,"d":"0.0%"}},0,{"v":0,"d":"0.0%"},null,null,"",null,{"$f":"IF(F65='Hilfstab Auswahl SOPÄ'!$O$8,ROUNDUP($E$9,0),IF(F65='Hilfstab Auswahl SOPÄ'!$O$9,ROUNDUP($E$10,0),IF(F65='Hilfstab Auswahl SOPÄ'!$O$10,ROUNDUP($E$11,0),$P$16)))","v":{"v":142293.15,"d":"Fr. 142,293.15"}}]
[{"$nulls":5},"Auswählen",null,null,{"$f":"IF(G66=\"\",0,G66*VLOOKUP(F66,'Hilfstab Auswahl SOPÄ'!$O$6:$P$11,2,FALSE))","v":{"v":0,"d":"0.0%"}},0,{"v":0,"d":"0.0%"},null,null,"",null,{"$f":"IF(F66='Hilfstab Auswahl SOPÄ'!$O$8,ROUNDUP($E$9,0),IF(F66='Hilfstab Auswahl SOPÄ'!$O$9,ROUNDUP($E$10,0),IF(F66='Hilfstab Auswahl SOPÄ'!$O$10,ROUNDUP($E$11,0),$P$16)))","v":{"v":142293.15,"d":"Fr. 142,293.15"}}]
[{"$nulls":5},"Auswählen",null,null,{"$f":"IF(G67=\"\",0,G67*VLOOKUP(F67,'Hilfstab Auswahl SOPÄ'!$O$6:$P$11,2,FALSE))","v":{"v":0,"d":"0.0%"}},0,{"v":0,"d":"0.0%"},null,null,"",null,{"$f":"IF(F67='Hilfstab Auswahl SOPÄ'!$O$8,ROUNDUP($E$9,0),IF(F67='Hilfstab Auswahl SOPÄ'!$O$9,ROUNDUP($E$10,0),IF(F67='Hilfstab Auswahl SOPÄ'!$O$10,ROUNDUP($E$11,0),$P$16)))","v":{"v":142293.15,"d":"Fr. 142,293.15"}}]
[{"$nulls":5},"Auswählen",null,null,{"$f":"IF(G68=\"\",0,G68*VLOOKUP(F68,'Hilfstab Auswahl SOPÄ'!$O$6:$P$11,2,FALSE))","v":{"v":0,"d":"0.0%"}},0,{"v":0,"d":"0.0%"},null,null,"",null,{"$f":"IF(F68='Hilfstab Auswahl SOPÄ'!$O$8,ROUNDUP($E$9,0),IF(F68='Hilfstab Auswahl SOPÄ'!$O$9,ROUNDUP($E$10,0),IF(F68='Hilfstab Auswahl SOPÄ'!$O$10,ROUNDUP($E$11,0),$P$16)))","v":{"v":142293.15,"d":"Fr. 142,293.15"}}]
[{"$nulls":5},"Auswählen",null,null,{"$f":"IF(G69=\"\",0,G69*VLOOKUP(F69,'Hilfstab Auswahl SOPÄ'!$O$6:$P$11,2,FALSE))","v":{"v":0,"d":"0.0%"}},0,{"v":0,"d":"0.0%"},null,null,"",null,{"$f":"IF(F69='Hilfstab Auswahl SOPÄ'!$O$8,ROUNDUP($E$9,0),IF(F69='Hilfstab Auswahl SOPÄ'!$O$9,ROUNDUP($E$10,0),IF(F69='Hilfstab Auswahl SOPÄ'!$O$10,ROUNDUP($E$11,0),$P$16)))","v":{"v":142293.15,"d":"Fr. 142,293.15"}}]
[{"$nulls":5},"Auswählen",null,null,{"$f":"IF(G70=\"\",0,G70*VLOOKUP(F70,'Hilfstab Auswahl SOPÄ'!$O$6:$P$11,2,FALSE))","v":{"v":0,"d":"0.0%"}},0,{"v":0,"d":"0.0%"},null,null,"",null,{"$f":"IF(F70='Hilfstab Auswahl SOPÄ'!$O$8,ROUNDUP($E$9,0),IF(F70='Hilfstab Auswahl SOPÄ'!$O$9,ROUNDUP($E$10,0),IF(F70='Hilfstab Auswahl SOPÄ'!$O$10,ROUNDUP($E$11,0),$P$16)))","v":{"v":142293.15,"d":"Fr. 142,293.15"}}]
[{"$nulls":5},"Auswählen",null,null,{"$f":"IF(G71=\"\",0,G71*VLOOKUP(F71,'Hilfstab Auswahl SOPÄ'!$O$6:$P$11,2,FALSE))","v":{"v":0,"d":"0.0%"}},0,{"v":0,"d":"0.0%"},null,null,"",null,{"$f":"IF(F71='Hilfstab Auswahl SOPÄ'!$O$8,ROUNDUP($E$9,0),IF(F71='Hilfstab Auswahl SOPÄ'!$O$9,ROUNDUP($E$10,0),IF(F71='Hilfstab Auswahl SOPÄ'!$O$10,ROUNDUP($E$11,0),$P$16)))","v":{"v":142293.15,"d":"Fr. 142,293.15"}}]
[{"$nulls":5},"Auswählen",null,null,{"$f":"IF(G72=\"\",0,G72*VLOOKUP(F72,'Hilfstab Auswahl SOPÄ'!$O$6:$P$11,2,FALSE))","v":{"v":0,"d":"0.0%"}},0,{"v":0,"d":"0.0%"},null,null,"",null,{"$f":"IF(F72='Hilfstab Auswahl SOPÄ'!$O$8,ROUNDUP($E$9,0),IF(F72='Hilfstab Auswahl SOPÄ'!$O$9,ROUNDUP($E$10,0),IF(F72='Hilfstab Auswahl SOPÄ'!$O$10,ROUNDUP($E$11,0),$P$16)))","v":{"v":142293.15,"d":"Fr. 142,293.15"}}]
[{"$nulls":5},"Auswählen",null,null,{"$f":"IF(G73=\"\",0,G73*VLOOKUP(F73,'Hilfstab Auswahl SOPÄ'!$O$6:$P$11,2,FALSE))","v":{"v":0,"d":"0.0%"}},0,{"v":0,"d":"0.0%"},null,null,"",null,{"$f":"IF(F73='Hilfstab Auswahl SOPÄ'!$O$8,ROUNDUP($E$9,0),IF(F73='Hilfstab Auswahl SOPÄ'!$O$9,ROUNDUP($E$10,0),IF(F73='Hilfstab Auswahl SOPÄ'!$O$10,ROUNDUP($E$11,0),$P$16)))","v":{"v":142293.15,"d":"Fr. 142,293.15"}}]
[{"$nulls":5},"Auswählen",null,null,{"$f":"IF(G74=\"\",0,G74*VLOOKUP(F74,'Hilfstab Auswahl SOPÄ'!$O$6:$P$11,2,FALSE))","v":{"v":0,"d":"0.0%"}},0,{"v":0,"d":"0.0%"},null,null,"",null,{"$f":"IF(F74='Hilfstab Auswahl SOPÄ'!$O$8,ROUNDUP($E$9,0),IF(F74='Hilfstab Auswahl SOPÄ'!$O$9,ROUNDUP($E$10,0),IF(F74='Hilfstab Auswahl SOPÄ'!$O$10,ROUNDUP($E$11,0),$P$16)))","v":{"v":142293.15,"d":"Fr. 142,293.15"}}]
[{"$nulls":5},"Auswählen",null,null,{"$f":"IF(G75=\"\",0,G75*VLOOKUP(F75,'Hilfstab Auswahl SOPÄ'!$O$6:$P$11,2,FALSE))","v":{"v":0,"d":"0.0%"}},0,{"v":0,"d":"0.0%"},null,null,"",null,{"$f":"IF(F75='Hilfstab Auswahl SOPÄ'!$O$8,ROUNDUP($E$9,0),IF(F75='Hilfstab Auswahl SOPÄ'!$O$9,ROUNDUP($E$10,0),IF(F75='Hilfstab Auswahl SOPÄ'!$O$10,ROUNDUP($E$11,0),$P$16)))","v":{"v":142293.15,"d":"Fr. 142,293.15"}}]
[{"$nulls":5},"Auswählen",null,null,{"$f":"IF(G76=\"\",0,G76*VLOOKUP(F76,'Hilfstab Auswahl SOPÄ'!$O$6:$P$11,2,FALSE))","v":{"v":0,"d":"0.0%"}},0,{"v":0,"d":"0.0%"},null,null,"",null,{"$f":"IF(F76='Hilfstab Auswahl SOPÄ'!$O$8,ROUNDUP($E$9,0),IF(F76='Hilfstab Auswahl SOPÄ'!$O$9,ROUNDUP($E$10,0),IF(F76='Hilfstab Auswahl SOPÄ'!$O$10,ROUNDUP($E$11,0),$P$16)))","v":{"v":142293.15,"d":"Fr. 142,293.15"}}]
[{"$nulls":5},"Auswählen",null,null,{"$f":"IF(G77=\"\",0,G77*VLOOKUP(F77,'Hilfstab Auswahl SOPÄ'!$O$6:$P$11,2,FALSE))","v":{"v":0,"d":"0.0%"}},0,{"v":0,"d":"0.0%"},null,null,"",null,{"$f":"IF(F77='Hilfstab Auswahl SOPÄ'!$O$8,ROUNDUP($E$9,0),IF(F77='Hilfstab Auswahl SOPÄ'!$O$9,ROUNDUP($E$10,0),IF(F77='Hilfstab Auswahl SOPÄ'!$O$10,ROUNDUP($E$11,0),$P$16)))","v":{"v":142293.15,"d":"Fr. 142,293.15"}}]
[{"$nulls":5},"Auswählen",null,null,{"$f":"IF(G78=\"\",0,G78*VLOOKUP(F78,'Hilfstab Auswahl SOPÄ'!$O$6:$P$11,2,FALSE))","v":{"v":0,"d":"0.0%"}},0,{"v":0,"d":"0.0%"},null,null,"",null,{"$f":"IF(F78='Hilfstab Auswahl SOPÄ'!$O$8,ROUNDUP($E$9,0),IF(F78='Hilfstab Auswahl SOPÄ'!$O$9,ROUNDUP($E$10,0),IF(F78='Hilfstab Auswahl SOPÄ'!$O$10,ROUNDUP($E$11,0),$P$16)))","v":{"v":142293.15,"d":"Fr. 142,293.15"}}]
[{"$nulls":5},"Auswählen",null,null,{"$f":"IF(G79=\"\",0,G79*VLOOKUP(F79,'Hilfstab Auswahl SOPÄ'!$O$6:$P$11,2,FALSE))","v":{"v":0,"d":"0.0%"}},0,{"v":0,"d":"0.0%"},null,null,"",null,{"$f":"IF(F79='Hilfstab Auswahl SOPÄ'!$O$8,ROUNDUP($E$9,0),IF(F79='Hilfstab Auswahl SOPÄ'!$O$9,ROUNDUP($E$10,0),IF(F79='Hilfstab Auswahl SOPÄ'!$O$10,ROUNDUP($E$11,0),$P$16)))","v":{"v":142293.15,"d":"Fr. 142,293.15"}}]
[{"$nulls":5},"Auswählen",null,null,{"$f":"IF(G80=\"\",0,G80*VLOOKUP(F80,'Hilfstab Auswahl SOPÄ'!$O$6:$P$11,2,FALSE))","v":{"v":0,"d":"0.0%"}},0,{"v":0,"d":"0.0%"},null,null,"",null,{"$f":"IF(F80='Hilfstab Auswahl SOPÄ'!$O$8,ROUNDUP($E$9,0),IF(F80='Hilfstab Auswahl SOPÄ'!$O$9,ROUNDUP($E$10,0),IF(F80='Hilfstab Auswahl SOPÄ'!$O$10,ROUNDUP($E$11,0),$P$16)))","v":{"v":142293.15,"d":"Fr. 142,293.15"}}]
[{"$nulls":5},"Auswählen",null,null,{"$f":"IF(G81=\"\",0,G81*VLOOKUP(F81,'Hilfstab Auswahl SOPÄ'!$O$6:$P$11,2,FALSE))","v":{"v":0,"d":"0.0%"}},0,{"v":0,"d":"0.0%"},null,null,"",null,{"$f":"IF(F81='Hilfstab Auswahl SOPÄ'!$O$8,ROUNDUP($E$9,0),IF(F81='Hilfstab Auswahl SOPÄ'!$O$9,ROUNDUP($E$10,0),IF(F81='Hilfstab Auswahl SOPÄ'!$O$10,ROUNDUP($E$11,0),$P$16)))","v":{"v":142293.15,"d":"Fr. 142,293.15"}}]
[{"$nulls":5},"Auswählen",null,null,{"$f":"IF(G82=\"\",0,G82*VLOOKUP(F82,'Hilfstab Auswahl SOPÄ'!$O$6:$P$11,2,FALSE))","v":{"v":0,"d":"0.0%"}},0,{"v":0,"d":"0.0%"},null,null,"",null,{"$f":"IF(F82='Hilfstab Auswahl SOPÄ'!$O$8,ROUNDUP($E$9,0),IF(F82='Hilfstab Auswahl SOPÄ'!$O$9,ROUNDUP($E$10,0),IF(F82='Hilfstab Auswahl SOPÄ'!$O$10,ROUNDUP($E$11,0),$P$16)))","v":{"v":142293.15,"d":"Fr. 142,293.15"}}]
[{"$nulls":5},"Auswählen",null,null,{"$f":"IF(G83=\"\",0,G83*VLOOKUP(F83,'Hilfstab Auswahl SOPÄ'!$O$6:$P$11,2,FALSE))","v":{"v":0,"d":"0.0%"}},0,{"v":0,"d":"0.0%"},null,null,"",null,{"$f":"IF(F83='Hilfstab Auswahl SOPÄ'!$O$8,ROUNDUP($E$9,0),IF(F83='Hilfstab Auswahl SOPÄ'!$O$9,ROUNDUP($E$10,0),IF(F83='Hilfstab Auswahl SOPÄ'!$O$10,ROUNDUP($E$11,0),$P$16)))","v":{"v":142293.15,"d":"Fr. 142,293.15"}}]
[{"$nulls":5},"Auswählen",null,null,{"$f":"IF(G84=\"\",0,G84*VLOOKUP(F84,'Hilfstab Auswahl SOPÄ'!$O$6:$P$11,2,FALSE))","v":{"v":0,"d":"0.0%"}},{"$f":"IF(G84=0,0,H84/G84*100%)","v":0},{"$f":"IF(L84=\"ja\",G84,0)","v":{"v":0,"d":"0.0%"}},null,null,"",null,{"$f":"IF(F84='Hilfstab Auswahl SOPÄ'!$O$8,ROUNDUP($E$9,0),IF(F84='Hilfstab Auswahl SOPÄ'!$O$9,ROUNDUP($E$10,0),IF(F84='Hilfstab Auswahl SOPÄ'!$O$10,ROUNDUP($E$11,0),$P$16)))","v":{"v":142293.15,"d":"Fr. 142,293.15"}}]
[{"$nulls":5},"Auswählen",null,null,{"$f":"IF(G85=\"\",0,G85*VLOOKUP(F85,'Hilfstab Auswahl SOPÄ'!$O$6:$P$11,2,FALSE))","v":{"v":0,"d":"0.0%"}},0,{"v":0,"d":"0.0%"},null,null,"",null,{"$f":"IF(F85='Hilfstab Auswahl SOPÄ'!$O$8,ROUNDUP($E$9,0),IF(F85='Hilfstab Auswahl SOPÄ'!$O$9,ROUNDUP($E$10,0),IF(F85='Hilfstab Auswahl SOPÄ'!$O$10,ROUNDUP($E$11,0),$P$16)))","v":{"v":142293.15,"d":"Fr. 142,293.15"}}]
[{"$nulls":5},"Auswählen",null,null,{"$f":"IF(G86=\"\",0,G86*VLOOKUP(F86,'Hilfstab Auswahl SOPÄ'!$O$6:$P$11,2,FALSE))","v":{"v":0,"d":"0.0%"}},0,{"v":0,"d":"0.0%"},null,null,"",null,{"$f":"IF(F86='Hilfstab Auswahl SOPÄ'!$O$8,ROUNDUP($E$9,0),IF(F86='Hilfstab Auswahl SOPÄ'!$O$9,ROUNDUP($E$10,0),IF(F86='Hilfstab Auswahl SOPÄ'!$O$10,ROUNDUP($E$11,0),$P$16)))","v":{"v":142293.15,"d":"Fr. 142,293.15"}}]
[{"$nulls":5},"Auswählen",null,null,{"$f":"IF(G87=\"\",0,G87*VLOOKUP(F87,'Hilfstab Auswahl SOPÄ'!$O$6:$P$11,2,FALSE))","v":{"v":0,"d":"0.0%"}},0,{"v":0,"d":"0.0%"},null,null,"",null,{"$f":"IF(F87='Hilfstab Auswahl SOPÄ'!$O$8,ROUNDUP($E$9,0),IF(F87='Hilfstab Auswahl SOPÄ'!$O$9,ROUNDUP($E$10,0),IF(F87='Hilfstab Auswahl SOPÄ'!$O$10,ROUNDUP($E$11,0),$P$16)))","v":{"v":142293.15,"d":"Fr. 142,293.15"}}]
[{"$nulls":5},"Auswählen",null,null,{"$f":"IF(G88=\"\",0,G88*VLOOKUP(F88,'Hilfstab Auswahl SOPÄ'!$O$6:$P$11,2,FALSE))","v":{"v":0,"d":"0.0%"}},0,{"v":0,"d":"0.0%"},null,null,"",null,{"$f":"IF(F88='Hilfstab Auswahl SOPÄ'!$O$8,ROUNDUP($E$9,0),IF(F88='Hilfstab Auswahl SOPÄ'!$O$9,ROUNDUP($E$10,0),IF(F88='Hilfstab Auswahl SOPÄ'!$O$10,ROUNDUP($E$11,0),$P$16)))","v":{"v":142293.15,"d":"Fr. 142,293.15"}}]
[{"$nulls":5},"Auswählen",null,null,{"$f":"IF(G89=\"\",0,G89*VLOOKUP(F89,'Hilfstab Auswahl SOPÄ'!$O$6:$P$11,2,FALSE))","v":{"v":0,"d":"0.0%"}},0,{"v":0,"d":"0.0%"},null,null,"",null,{"$f":"IF(F89='Hilfstab Auswahl SOPÄ'!$O$8,ROUNDUP($E$9,0),IF(F89='Hilfstab Auswahl SOPÄ'!$O$9,ROUNDUP($E$10,0),IF(F89='Hilfstab Auswahl SOPÄ'!$O$10,ROUNDUP($E$11,0),$P$16)))","v":{"v":142293.15,"d":"Fr. 142,293.15"}}]
[{"$nulls":5},"Auswählen",null,null,{"$f":"IF(G90=\"\",0,G90*VLOOKUP(F90,'Hilfstab Auswahl SOPÄ'!$O$6:$P$11,2,FALSE))","v":{"v":0,"d":"0.0%"}},0,{"v":0,"d":"0.0%"},null,null,"",null,{"$f":"IF(F90='Hilfstab Auswahl SOPÄ'!$O$8,ROUNDUP($E$9,0),IF(F90='Hilfstab Auswahl SOPÄ'!$O$9,ROUNDUP($E$10,0),IF(F90='Hilfstab Auswahl SOPÄ'!$O$10,ROUNDUP($E$11,0),$P$16)))","v":{"v":142293.15,"d":"Fr. 142,293.15"}}]
[{"$nulls":5},"Auswählen",null,null,{"$f":"IF(G91=\"\",0,G91*VLOOKUP(F91,'Hilfstab Auswahl SOPÄ'!$O$6:$P$11,2,FALSE))","v":{"v":0,"d":"0.0%"}},0,{"v":0,"d":"0.0%"},null,null,"",null,{"$f":"IF(F91='Hilfstab Auswahl SOPÄ'!$O$8,ROUNDUP($E$9,0),IF(F91='Hilfstab Auswahl SOPÄ'!$O$9,ROUNDUP($E$10,0),IF(F91='Hilfstab Auswahl SOPÄ'!$O$10,ROUNDUP($E$11,0),$P$16)))","v":{"v":142293.15,"d":"Fr. 142,293.15"}}]
[{"$nulls":5},"Auswählen",null,null,{"$f":"IF(G92=\"\",0,G92*VLOOKUP(F92,'Hilfstab Auswahl SOPÄ'!$O$6:$P$11,2,FALSE))","v":{"v":0,"d":"0.0%"}},0,{"v":0,"d":"0.0%"},null,null,"",null,{"$f":"IF(F92='Hilfstab Auswahl SOPÄ'!$O$8,ROUNDUP($E$9,0),IF(F92='Hilfstab Auswahl SOPÄ'!$O$9,ROUNDUP($E$10,0),IF(F92='Hilfstab Auswahl SOPÄ'!$O$10,ROUNDUP($E$11,0),$P$16)))","v":{"v":142293.15,"d":"Fr. 142,293.15"}}]
[{"$nulls":5},"Auswählen",null,null,{"$f":"IF(G93=\"\",0,G93*VLOOKUP(F93,'Hilfstab Auswahl SOPÄ'!$O$6:$P$11,2,FALSE))","v":{"v":0,"d":"0.0%"}},0,{"v":0,"d":"0.0%"},null,null,"",null,{"$f":"IF(F93='Hilfstab Auswahl SOPÄ'!$O$8,ROUNDUP($E$9,0),IF(F93='Hilfstab Auswahl SOPÄ'!$O$9,ROUNDUP($E$10,0),IF(F93='Hilfstab Auswahl SOPÄ'!$O$10,ROUNDUP($E$11,0),$P$16)))","v":{"v":142293.15,"d":"Fr. 142,293.15"}}]
[{"$nulls":5},"Auswählen",null,null,{"$f":"IF(G94=\"\",0,G94*VLOOKUP(F94,'Hilfstab Auswahl SOPÄ'!$O$6:$P$11,2,FALSE))","v":{"v":0,"d":"0.0%"}},0,{"v":0,"d":"0.0%"},null,null,"",null,{"$f":"IF(F94='Hilfstab Auswahl SOPÄ'!$O$8,ROUNDUP($E$9,0),IF(F94='Hilfstab Auswahl SOPÄ'!$O$9,ROUNDUP($E$10,0),IF(F94='Hilfstab Auswahl SOPÄ'!$O$10,ROUNDUP($E$11,0),$P$16)))","v":{"v":142293.15,"d":"Fr. 142,293.15"}}]
[{"$nulls":5},"Auswählen",null,null,{"$f":"IF(G95=\"\",0,G95*VLOOKUP(F95,'Hilfstab Auswahl SOPÄ'!$O$6:$P$11,2,FALSE))","v":{"v":0,"d":"0.0%"}},0,{"v":0,"d":"0.0%"},null,null,"",null,{"$f":"IF(F95='Hilfstab Auswahl SOPÄ'!$O$8,ROUNDUP($E$9,0),IF(F95='Hilfstab Auswahl SOPÄ'!$O$9,ROUNDUP($E$10,0),IF(F95='Hilfstab Auswahl SOPÄ'!$O$10,ROUNDUP($E$11,0),$P$16)))","v":{"v":142293.15,"d":"Fr. 142,293.15"}}]
[{"$nulls":5},"Auswählen",null,null,{"$f":"IF(G96=\"\",0,G96*VLOOKUP(F96,'Hilfstab Auswahl SOPÄ'!$O$6:$P$11,2,FALSE))","v":{"v":0,"d":"0.0%"}},0,{"v":0,"d":"0.0%"},null,null,"",null,{"$f":"IF(F96='Hilfstab Auswahl SOPÄ'!$O$8,ROUNDUP($E$9,0),IF(F96='Hilfstab Auswahl SOPÄ'!$O$9,ROUNDUP($E$10,0),IF(F96='Hilfstab Auswahl SOPÄ'!$O$10,ROUNDUP($E$11,0),$P$16)))","v":{"v":142293.15,"d":"Fr. 142,293.15"}}]
[{"$nulls":5},"Auswählen",null,null,{"$f":"IF(G97=\"\",0,G97*VLOOKUP(F97,'Hilfstab Auswahl SOPÄ'!$O$6:$P$11,2,FALSE))","v":{"v":0,"d":"0.0%"}},0,{"v":0,"d":"0.0%"},null,null,"",null,{"$f":"IF(F97='Hilfstab Auswahl SOPÄ'!$O$8,ROUNDUP($E$9,0),IF(F97='Hilfstab Auswahl SOPÄ'!$O$9,ROUNDUP($E$10,0),IF(F97='Hilfstab Auswahl SOPÄ'!$O$10,ROUNDUP($E$11,0),$P$16)))","v":{"v":142293.15,"d":"Fr. 142,293.15"}}]
[{"$nulls":5},"Auswählen",null,null,{"$f":"IF(G98=\"\",0,G98*VLOOKUP(F98,'Hilfstab Auswahl SOPÄ'!$O$6:$P$11,2,FALSE))","v":{"v":0,"d":"0.0%"}},0,{"v":0,"d":"0.0%"},null,null,"",null,{"$f":"IF(F98='Hilfstab Auswahl SOPÄ'!$O$8,ROUNDUP($E$9,0),IF(F98='Hilfstab Auswahl SOPÄ'!$O$9,ROUNDUP($E$10,0),IF(F98='Hilfstab Auswahl SOPÄ'!$O$10,ROUNDUP($E$11,0),$P$16)))","v":{"v":142293.15,"d":"Fr. 142,293.15"}}]
[{"$nulls":5},"Auswählen",null,null,{"$f":"IF(G99=\"\",0,G99*VLOOKUP(F99,'Hilfstab Auswahl SOPÄ'!$O$6:$P$11,2,FALSE))","v":{"v":0,"d":"0.0%"}},0,{"v":0,"d":"0.0%"},null,null,"",null,{"$f":"IF(F99='Hilfstab Auswahl SOPÄ'!$O$8,ROUNDUP($E$9,0),IF(F99='Hilfstab Auswahl SOPÄ'!$O$9,ROUNDUP($E$10,0),IF(F99='Hilfstab Auswahl SOPÄ'!$O$10,ROUNDUP($E$11,0),$P$16)))","v":{"v":142293.15,"d":"Fr. 142,293.15"}}]
[{"$nulls":5},"Auswählen",null,null,{"$f":"IF(G100=\"\",0,G100*VLOOKUP(F100,'Hilfstab Auswahl SOPÄ'!$O$6:$P$11,2,FALSE))","v":{"v":0,"d":"0.0%"}},0,{"v":0,"d":"0.0%"},null,null,"",null,{"$f":"IF(F100='Hilfstab Auswahl SOPÄ'!$O$8,ROUNDUP($E$9,0),IF(F100='Hilfstab Auswahl SOPÄ'!$O$9,ROUNDUP($E$10,0),IF(F100='Hilfstab Auswahl SOPÄ'!$O$10,ROUNDUP($E$11,0),$P$16)))","v":{"v":142293.15,"d":"Fr. 142,293.15"}}]
[{"$nulls":5},"Auswählen",null,null,{"$f":"IF(G101=\"\",0,G101*VLOOKUP(F101,'Hilfstab Auswahl SOPÄ'!$O$6:$P$11,2,FALSE))","v":{"v":0,"d":"0.0%"}},0,{"v":0,"d":"0.0%"},null,null,"",null,{"$f":"IF(F101='Hilfstab Auswahl SOPÄ'!$O$8,ROUNDUP($E$9,0),IF(F101='Hilfstab Auswahl SOPÄ'!$O$9,ROUNDUP($E$10,0),IF(F101='Hilfstab Auswahl SOPÄ'!$O$10,ROUNDUP($E$11,0),$P$16)))","v":{"v":142293.15,"d":"Fr. 142,293.15"}}]
[{"$nulls":5},"Auswählen",null,null,{"$f":"IF(G102=\"\",0,G102*VLOOKUP(F102,'Hilfstab Auswahl SOPÄ'!$O$6:$P$11,2,FALSE))","v":{"v":0,"d":"0.0%"}},0,{"v":0,"d":"0.0%"},null,null,"",null,{"$f":"IF(F102='Hilfstab Auswahl SOPÄ'!$O$8,ROUNDUP($E$9,0),IF(F102='Hilfstab Auswahl SOPÄ'!$O$9,ROUNDUP($E$10,0),IF(F102='Hilfstab Auswahl SOPÄ'!$O$10,ROUNDUP($E$11,0),$P$16)))","v":{"v":142293.15,"d":"Fr. 142,293.15"}}]
[{"$nulls":5},"Auswählen",null,null,{"$f":"IF(G103=\"\",0,G103*VLOOKUP(F103,'Hilfstab Auswahl SOPÄ'!$O$6:$P$11,2,FALSE))","v":{"v":0,"d":"0.0%"}},0,{"v":0,"d":"0.0%"},null,null,"",null,{"$f":"IF(F103='Hilfstab Auswahl SOPÄ'!$O$8,ROUNDUP($E$9,0),IF(F103='Hilfstab Auswahl SOPÄ'!$O$9,ROUNDUP($E$10,0),IF(F103='Hilfstab Auswahl SOPÄ'!$O$10,ROUNDUP($E$11,0),$P$16)))","v":{"v":142293.15,"d":"Fr. 142,293.15"}}]
[{"$nulls":5},"Auswählen",null,null,{"$f":"IF(G104=\"\",0,G104*VLOOKUP(F104,'Hilfstab Auswahl SOPÄ'!$O$6:$P$11,2,FALSE))","v":{"v":0,"d":"0.0%"}},0,{"v":0,"d":"0.0%"},null,null,"",null,{"$f":"IF(F104='Hilfstab Auswahl SOPÄ'!$O$8,ROUNDUP($E$9,0),IF(F104='Hilfstab Auswahl SOPÄ'!$O$9,ROUNDUP($E$10,0),IF(F104='Hilfstab Auswahl SOPÄ'!$O$10,ROUNDUP($E$11,0),$P$16)))","v":{"v":142293.15,"d":"Fr. 142,293.15"}}]
[{"$nulls":5},"Auswählen",null,null,{"$f":"IF(G105=\"\",0,G105*VLOOKUP(F105,'Hilfstab Auswahl SOPÄ'!$O$6:$P$11,2,FALSE))","v":{"v":0,"d":"0.0%"}},0,{"v":0,"d":"0.0%"},null,null,"",null,{"$f":"IF(F105='Hilfstab Auswahl SOPÄ'!$O$8,ROUNDUP($E$9,0),IF(F105='Hilfstab Auswahl SOPÄ'!$O$9,ROUNDUP($E$10,0),IF(F105='Hilfstab Auswahl SOPÄ'!$O$10,ROUNDUP($E$11,0),$P$16)))","v":{"v":142293.15,"d":"Fr. 142,293.15"}}]
[{"$nulls":5},"Auswählen",null,null,{"$f":"IF(G106=\"\",0,G106*VLOOKUP(F106,'Hilfstab Auswahl SOPÄ'!$O$6:$P$11,2,FALSE))","v":{"v":0,"d":"0.0%"}},0,{"v":0,"d":"0.0%"},null,null,"",null,{"$f":"IF(F106='Hilfstab Auswahl SOPÄ'!$O$8,ROUNDUP($E$9,0),IF(F106='Hilfstab Auswahl SOPÄ'!$O$9,ROUNDUP($E$10,0),IF(F106='Hilfstab Auswahl SOPÄ'!$O$10,ROUNDUP($E$11,0),$P$16)))","v":{"v":142293.15,"d":"Fr. 142,293.15"}}]
[{"$nulls":5},"Auswählen",null,null,{"$f":"IF(G107=\"\",0,G107*VLOOKUP(F107,'Hilfstab Auswahl SOPÄ'!$O$6:$P$11,2,FALSE))","v":{"v":0,"d":"0.0%"}},0,{"v":0,"d":"0.0%"},null,null,"",null,{"$f":"IF(F107='Hilfstab Auswahl SOPÄ'!$O$8,ROUNDUP($E$9,0),IF(F107='Hilfstab Auswahl SOPÄ'!$O$9,ROUNDUP($E$10,0),IF(F107='Hilfstab Auswahl SOPÄ'!$O$10,ROUNDUP($E$11,0),$P$16)))","v":{"v":142293.15,"d":"Fr. 142,293.15"}}]
[{"$nulls":5},"Auswählen",null,null,{"$f":"IF(G108=\"\",0,G108*VLOOKUP(F108,'Hilfstab Auswahl SOPÄ'!$O$6:$P$11,2,FALSE))","v":{"v":0,"d":"0.0%"}},0,{"v":0,"d":"0.0%"},null,null,"",null,{"$f":"IF(F108='Hilfstab Auswahl SOPÄ'!$O$8,ROUNDUP($E$9,0),IF(F108='Hilfstab Auswahl SOPÄ'!$O$9,ROUNDUP($E$10,0),IF(F108='Hilfstab Auswahl SOPÄ'!$O$10,ROUNDUP($E$11,0),$P$16)))","v":{"v":142293.15,"d":"Fr. 142,293.15"}}]
[{"$nulls":5},"Auswählen",null,null,{"$f":"IF(G109=\"\",0,G109*VLOOKUP(F109,'Hilfstab Auswahl SOPÄ'!$O$6:$P$11,2,FALSE))","v":{"v":0,"d":"0.0%"}},0,{"v":0,"d":"0.0%"},null,null,"",null,{"$f":"IF(F109='Hilfstab Auswahl SOPÄ'!$O$8,ROUNDUP($E$9,0),IF(F109='Hilfstab Auswahl SOPÄ'!$O$9,ROUNDUP($E$10,0),IF(F109='Hilfstab Auswahl SOPÄ'!$O$10,ROUNDUP($E$11,0),$P$16)))","v":{"v":142293.15,"d":"Fr. 142,293.15"}}]
[{"$nulls":5},"Auswählen",null,null,{"$f":"IF(G110=\"\",0,G110*VLOOKUP(F110,'Hilfstab Auswahl SOPÄ'!$O$6:$P$11,2,FALSE))","v":{"v":0,"d":"0.0%"}},0,{"v":0,"d":"0.0%"},null,null,"",null,{"$f":"IF(F110='Hilfstab Auswahl SOPÄ'!$O$8,ROUNDUP($E$9,0),IF(F110='Hilfstab Auswahl SOPÄ'!$O$9,ROUNDUP($E$10,0),IF(F110='Hilfstab Auswahl SOPÄ'!$O$10,ROUNDUP($E$11,0),$P$16)))","v":{"v":142293.15,"d":"Fr. 142,293.15"}}]
[{"$nulls":5},"Auswählen",null,null,{"$f":"IF(G111=\"\",0,G111*VLOOKUP(F111,'Hilfstab Auswahl SOPÄ'!$O$6:$P$11,2,FALSE))","v":{"v":0,"d":"0.0%"}},0,{"v":0,"d":"0.0%"},null,null,"",null,{"$f":"IF(F111='Hilfstab Auswahl SOPÄ'!$O$8,ROUNDUP($E$9,0),IF(F111='Hilfstab Auswahl SOPÄ'!$O$9,ROUNDUP($E$10,0),IF(F111='Hilfstab Auswahl SOPÄ'!$O$10,ROUNDUP($E$11,0),$P$16)))","v":{"v":142293.15,"d":"Fr. 142,293.15"}}]
[{"$nulls":5},"Auswählen",null,null,{"$f":"IF(G112=\"\",0,G112*VLOOKUP(F112,'Hilfstab Auswahl SOPÄ'!$O$6:$P$11,2,FALSE))","v":{"v":0,"d":"0.0%"}},0,{"v":0,"d":"0.0%"},null,null,"",null,{"$f":"IF(F112='Hilfstab Auswahl SOPÄ'!$O$8,ROUNDUP($E$9,0),IF(F112='Hilfstab Auswahl SOPÄ'!$O$9,ROUNDUP($E$10,0),IF(F112='Hilfstab Auswahl SOPÄ'!$O$10,ROUNDUP($E$11,0),$P$16)))","v":{"v":142293.15,"d":"Fr. 142,293.15"}}]
[{"$nulls":5},"Auswählen",null,null,{"$f":"IF(G113=\"\",0,G113*VLOOKUP(F113,'Hilfstab Auswahl SOPÄ'!$O$6:$P$11,2,FALSE))","v":{"v":0,"d":"0.0%"}},0,{"v":0,"d":"0.0%"},null,null,"",null,{"$f":"IF(F113='Hilfstab Auswahl SOPÄ'!$O$8,ROUNDUP($E$9,0),IF(F113='Hilfstab Auswahl SOPÄ'!$O$9,ROUNDUP($E$10,0),IF(F113='Hilfstab Auswahl SOPÄ'!$O$10,ROUNDUP($E$11,0),$P$16)))","v":{"v":142293.15,"d":"Fr. 142,293.15"}}]
[{"$nulls":5},"Auswählen",null,null,{"$f":"IF(G114=\"\",0,G114*VLOOKUP(F114,'Hilfstab Auswahl SOPÄ'!$O$6:$P$11,2,FALSE))","v":{"v":0,"d":"0.0%"}},0,{"v":0,"d":"0.0%"},null,null,"",null,{"$f":"IF(F114='Hilfstab Auswahl SOPÄ'!$O$8,ROUNDUP($E$9,0),IF(F114='Hilfstab Auswahl SOPÄ'!$O$9,ROUNDUP($E$10,0),IF(F114='Hilfstab Auswahl SOPÄ'!$O$10,ROUNDUP($E$11,0),$P$16)))","v":{"v":142293.15,"d":"Fr. 142,293.15"}}]
[{"$nulls":5},"Auswählen",null,null,{"$f":"IF(G115=\"\",0,G115*VLOOKUP(F115,'Hilfstab Auswahl SOPÄ'!$O$6:$P$11,2,FALSE))","v":{"v":0,"d":"0.0%"}},0,{"v":0,"d":"0.0%"},null,null,"",null,{"$f":"IF(F115='Hilfstab Auswahl SOPÄ'!$O$8,ROUNDUP($E$9,0),IF(F115='Hilfstab Auswahl SOPÄ'!$O$9,ROUNDUP($E$10,0),IF(F115='Hilfstab Auswahl SOPÄ'!$O$10,ROUNDUP($E$11,0),$P$16)))","v":{"v":142293.15,"d":"Fr. 142,293.15"}}]
[{"$nulls":5},"Auswählen",null,null,{"$f":"IF(G116=\"\",0,G116*VLOOKUP(F116,'Hilfstab Auswahl SOPÄ'!$O$6:$P$11,2,FALSE))","v":{"v":0,"d":"0.0%"}},0,{"v":0,"d":"0.0%"},null,null,"",null,{"$f":"IF(F116='Hilfstab Auswahl SOPÄ'!$O$8,ROUNDUP($E$9,0),IF(F116='Hilfstab Auswahl SOPÄ'!$O$9,ROUNDUP($E$10,0),IF(F116='Hilfstab Auswahl SOPÄ'!$O$10,ROUNDUP($E$11,0),$P$16)))","v":{"v":142293.15,"d":"Fr. 142,293.15"}}]
[{"$nulls":5},"Auswählen",null,null,{"$f":"IF(G117=\"\",0,G117*VLOOKUP(F117,'Hilfstab Auswahl SOPÄ'!$O$6:$P$11,2,FALSE))","v":{"v":0,"d":"0.0%"}},0,{"v":0,"d":"0.0%"},null,null,"",null,{"$f":"IF(F117='Hilfstab Auswahl SOPÄ'!$O$8,ROUNDUP($E$9,0),IF(F117='Hilfstab Auswahl SOPÄ'!$O$9,ROUNDUP($E$10,0),IF(F117='Hilfstab Auswahl SOPÄ'!$O$10,ROUNDUP($E$11,0),$P$16)))","v":{"v":142293.15,"d":"Fr. 142,293.15"}}]
[{"$nulls":5},"Auswählen",null,null,{"$f":"IF(G118=\"\",0,G118*VLOOKUP(F118,'Hilfstab Auswahl SOPÄ'!$O$6:$P$11,2,FALSE))","v":{"v":0,"d":"0.0%"}},0,{"v":0,"d":"0.0%"},null,null,"",null,{"$f":"IF(F118='Hilfstab Auswahl SOPÄ'!$O$8,ROUNDUP($E$9,0),IF(F118='Hilfstab Auswahl SOPÄ'!$O$9,ROUNDUP($E$10,0),IF(F118='Hilfstab Auswahl SOPÄ'!$O$10,ROUNDUP($E$11,0),$P$16)))","v":{"v":142293.15,"d":"Fr. 142,293.15"}}]
[{"$nulls":5},"Auswählen",null,null,{"$f":"IF(G119=\"\",0,G119*VLOOKUP(F119,'Hilfstab Auswahl SOPÄ'!$O$6:$P$11,2,FALSE))","v":{"v":0,"d":"0.0%"}},0,{"v":0,"d":"0.0%"},null,null,{"$f":"IF(J119>P119,\"Lohn > Maximaleinstufung\",\"\")","v":""},null,{"$f":"IF(F119='Hilfstab Auswahl SOPÄ'!$O$8,ROUNDUP($E$9,0),IF(F119='Hilfstab Auswahl SOPÄ'!$O$9,ROUNDUP($E$10,0),IF(F119='Hilfstab Auswahl SOPÄ'!$O$10,ROUNDUP($E$11,0),$P$16)))","v":{"v":142293.15,"d":"Fr. 142,293.15"}}]
[{"$nulls":5},"Auswählen",null,null,{"$f":"IF(G120=\"\",0,G120*VLOOKUP(F120,'Hilfstab Auswahl SOPÄ'!$O$6:$P$11,2,FALSE))","v":{"v":0,"d":"0.0%"}},0,{"v":0,"d":"0.0%"},null,null,"",null,{"$f":"IF(F120='Hilfstab Auswahl SOPÄ'!$O$8,ROUNDUP($E$9,0),IF(F120='Hilfstab Auswahl SOPÄ'!$O$9,ROUNDUP($E$10,0),IF(F120='Hilfstab Auswahl SOPÄ'!$O$10,ROUNDUP($E$11,0),$P$16)))","v":{"v":142293.15,"d":"Fr. 142,293.15"}}]
[{"$nulls":5},"Auswählen",null,null,{"$f":"IF(G121=\"\",0,G121*VLOOKUP(F121,'Hilfstab Auswahl SOPÄ'!$O$6:$P$11,2,FALSE))","v":{"v":0,"d":"0.0%"}},0,{"v":0,"d":"0.0%"},null,null,"",null,{"$f":"IF(F121='Hilfstab Auswahl SOPÄ'!$O$8,ROUNDUP($E$9,0),IF(F121='Hilfstab Auswahl SOPÄ'!$O$9,ROUNDUP($E$10,0),IF(F121='Hilfstab Auswahl SOPÄ'!$O$10,ROUNDUP($E$11,0),$P$16)))","v":{"v":142293.15,"d":"Fr. 142,293.15"}}]
[{"$nulls":5},"Auswählen",null,null,{"$f":"IF(G122=\"\",0,G122*VLOOKUP(F122,'Hilfstab Auswahl SOPÄ'!$O$6:$P$11,2,FALSE))","v":{"v":0,"d":"0.0%"}},0,{"v":0,"d":"0.0%"},null,null,"",null,{"$f":"IF(F122='Hilfstab Auswahl SOPÄ'!$O$8,ROUNDUP($E$9,0),IF(F122='Hilfstab Auswahl SOPÄ'!$O$9,ROUNDUP($E$10,0),IF(F122='Hilfstab Auswahl SOPÄ'!$O$10,ROUNDUP($E$11,0),$P$16)))","v":{"v":142293.15,"d":"Fr. 142,293.15"}}]
[{"$nulls":5},"Auswählen",null,null,{"$f":"IF(G123=\"\",0,G123*VLOOKUP(F123,'Hilfstab Auswahl SOPÄ'!$O$6:$P$11,2,FALSE))","v":{"v":0,"d":"0.0%"}},0,{"v":0,"d":"0.0%"},null,null,"",null,{"$f":"IF(F123='Hilfstab Auswahl SOPÄ'!$O$8,ROUNDUP($E$9,0),IF(F123='Hilfstab Auswahl SOPÄ'!$O$9,ROUNDUP($E$10,0),IF(F123='Hilfstab Auswahl SOPÄ'!$O$10,ROUNDUP($E$11,0),$P$16)))","v":{"v":142293.15,"d":"Fr. 142,293.15"}}]
[{"$nulls":5},"Auswählen",null,null,{"$f":"IF(G124=\"\",0,G124*VLOOKUP(F124,'Hilfstab Auswahl SOPÄ'!$O$6:$P$11,2,FALSE))","v":{"v":0,"d":"0.0%"}},0,{"v":0,"d":"0.0%"},null,null,"",null,{"$f":"IF(F124='Hilfstab Auswahl SOPÄ'!$O$8,ROUNDUP($E$9,0),IF(F124='Hilfstab Auswahl SOPÄ'!$O$9,ROUNDUP($E$10,0),IF(F124='Hilfstab Auswahl SOPÄ'!$O$10,ROUNDUP($E$11,0),$P$16)))","v":{"v":142293.15,"d":"Fr. 142,293.15"}}]
[{"$nulls":5},"Auswählen",null,null,{"$f":"IF(G125=\"\",0,G125*VLOOKUP(F125,'Hilfstab Auswahl SOPÄ'!$O$6:$P$11,2,FALSE))","v":{"v":0,"d":"0.0%"}},0,{"v":0,"d":"0.0%"},null,null,"",null,{"$f":"IF(F125='Hilfstab Auswahl SOPÄ'!$O$8,ROUNDUP($E$9,0),IF(F125='Hilfstab Auswahl SOPÄ'!$O$9,ROUNDUP($E$10,0),IF(F125='Hilfstab Auswahl SOPÄ'!$O$10,ROUNDUP($E$11,0),$P$16)))","v":{"v":142293.15,"d":"Fr. 142,293.15"}}]
[{"$nulls":5},"Auswählen",null,null,{"$f":"IF(G126=\"\",0,G126*VLOOKUP(F126,'Hilfstab Auswahl SOPÄ'!$O$6:$P$11,2,FALSE))","v":{"v":0,"d":"0.0%"}},0,{"v":0,"d":"0.0%"},null,null,"",null,{"$f":"IF(F126='Hilfstab Auswahl SOPÄ'!$O$8,ROUNDUP($E$9,0),IF(F126='Hilfstab Auswahl SOPÄ'!$O$9,ROUNDUP($E$10,0),IF(F126='Hilfstab Auswahl SOPÄ'!$O$10,ROUNDUP($E$11,0),$P$16)))","v":{"v":142293.15,"d":"Fr. 142,293.15"}}]
[{"$nulls":5},"Auswählen",null,null,{"$f":"IF(G127=\"\",0,G127*VLOOKUP(F127,'Hilfstab Auswahl SOPÄ'!$O$6:$P$11,2,FALSE))","v":{"v":0,"d":"0.0%"}},0,{"v":0,"d":"0.0%"},null,null,"",null,{"$f":"IF(F127='Hilfstab Auswahl SOPÄ'!$O$8,ROUNDUP($E$9,0),IF(F127='Hilfstab Auswahl SOPÄ'!$O$9,ROUNDUP($E$10,0),IF(F127='Hilfstab Auswahl SOPÄ'!$O$10,ROUNDUP($E$11,0),$P$16)))","v":{"v":142293.15,"d":"Fr. 142,293.15"}}]
[{"$nulls":5},"Auswählen",null,null,{"$f":"IF(G128=\"\",0,G128*VLOOKUP(F128,'Hilfstab Auswahl SOPÄ'!$O$6:$P$11,2,FALSE))","v":{"v":0,"d":"0.0%"}},0,{"v":0,"d":"0.0%"},null,null,"",null,{"$f":"IF(F128='Hilfstab Auswahl SOPÄ'!$O$8,ROUNDUP($E$9,0),IF(F128='Hilfstab Auswahl SOPÄ'!$O$9,ROUNDUP($E$10,0),IF(F128='Hilfstab Auswahl SOPÄ'!$O$10,ROUNDUP($E$11,0),$P$16)))","v":{"v":142293.15,"d":"Fr. 142,293.15"}}]
[{"$nulls":5},"Auswählen",null,null,{"$f":"IF(G129=\"\",0,G129*VLOOKUP(F129,'Hilfstab Auswahl SOPÄ'!$O$6:$P$11,2,FALSE))","v":{"v":0,"d":"0.0%"}},0,{"v":0,"d":"0.0%"},null,null,"",null,{"$f":"IF(F129='Hilfstab Auswahl SOPÄ'!$O$8,ROUNDUP($E$9,0),IF(F129='Hilfstab Auswahl SOPÄ'!$O$9,ROUNDUP($E$10,0),IF(F129='Hilfstab Auswahl SOPÄ'!$O$10,ROUNDUP($E$11,0),$P$16)))","v":{"v":142293.15,"d":"Fr. 142,293.15"}}]
[{"$nulls":5},"Auswählen",null,null,{"$f":"IF(G130=\"\",0,G130*VLOOKUP(F130,'Hilfstab Auswahl SOPÄ'!$O$6:$P$11,2,FALSE))","v":{"v":0,"d":"0.0%"}},0,{"v":0,"d":"0.0%"},null,null,"",null,{"$f":"IF(F130='Hilfstab Auswahl SOPÄ'!$O$8,ROUNDUP($E$9,0),IF(F130='Hilfstab Auswahl SOPÄ'!$O$9,ROUNDUP($E$10,0),IF(F130='Hilfstab Auswahl SOPÄ'!$O$10,ROUNDUP($E$11,0),$P$16)))","v":{"v":142293.15,"d":"Fr. 142,293.15"}}]
[{"$nulls":5},"Auswählen",null,null,{"$f":"IF(G131=\"\",0,G131*VLOOKUP(F131,'Hilfstab Auswahl SOPÄ'!$O$6:$P$11,2,FALSE))","v":{"v":0,"d":"0.0%"}},0,{"v":0,"d":"0.0%"},null,null,"",null,{"$f":"IF(F131='Hilfstab Auswahl SOPÄ'!$O$8,ROUNDUP($E$9,0),IF(F131='Hilfstab Auswahl SOPÄ'!$O$9,ROUNDUP($E$10,0),IF(F131='Hilfstab Auswahl SOPÄ'!$O$10,ROUNDUP($E$11,0),$P$16)))","v":{"v":142293.15,"d":"Fr. 142,293.15"}}]
[{"$nulls":5},"Auswählen",null,null,{"$f":"IF(G132=\"\",0,G132*VLOOKUP(F132,'Hilfstab Auswahl SOPÄ'!$O$6:$P$11,2,FALSE))","v":{"v":0,"d":"0.0%"}},0,{"v":0,"d":"0.0%"},null,null,"",null,{"$f":"IF(F132='Hilfstab Auswahl SOPÄ'!$O$8,ROUNDUP($E$9,0),IF(F132='Hilfstab Auswahl SOPÄ'!$O$9,ROUNDUP($E$10,0),IF(F132='Hilfstab Auswahl SOPÄ'!$O$10,ROUNDUP($E$11,0),$P$16)))","v":{"v":142293.15,"d":"Fr. 142,293.15"}}]
[{"$nulls":5},"Auswählen",null,null,{"$f":"IF(G133=\"\",0,G133*VLOOKUP(F133,'Hilfstab Auswahl SOPÄ'!$O$6:$P$11,2,FALSE))","v":{"v":0,"d":"0.0%"}},0,{"v":0,"d":"0.0%"},null,null,"",null,{"$f":"IF(F133='Hilfstab Auswahl SOPÄ'!$O$8,ROUNDUP($E$9,0),IF(F133='Hilfstab Auswahl SOPÄ'!$O$9,ROUNDUP($E$10,0),IF(F133='Hilfstab Auswahl SOPÄ'!$O$10,ROUNDUP($E$11,0),$P$16)))","v":{"v":142293.15,"d":"Fr. 142,293.15"}}]
[{"$nulls":5},"Auswählen",null,null,{"$f":"IF(G134=\"\",0,G134*VLOOKUP(F134,'Hilfstab Auswahl SOPÄ'!$O$6:$P$11,2,FALSE))","v":{"v":0,"d":"0.0%"}},0,{"v":0,"d":"0.0%"},null,null,"",null,{"$f":"IF(F134='Hilfstab Auswahl SOPÄ'!$O$8,ROUNDUP($E$9,0),IF(F134='Hilfstab Auswahl SOPÄ'!$O$9,ROUNDUP($E$10,0),IF(F134='Hilfstab Auswahl SOPÄ'!$O$10,ROUNDUP($E$11,0),$P$16)))","v":{"v":142293.15,"d":"Fr. 142,293.15"}}]
[{"$nulls":5},"Auswählen",null,null,{"$f":"IF(G135=\"\",0,G135*VLOOKUP(F135,'Hilfstab Auswahl SOPÄ'!$O$6:$P$11,2,FALSE))","v":{"v":0,"d":"0.0%"}},0,{"v":0,"d":"0.0%"},null,null,"",null,{"$f":"IF(F135='Hilfstab Auswahl SOPÄ'!$O$8,ROUNDUP($E$9,0),IF(F135='Hilfstab Auswahl SOPÄ'!$O$9,ROUNDUP($E$10,0),IF(F135='Hilfstab Auswahl SOPÄ'!$O$10,ROUNDUP($E$11,0),$P$16)))","v":{"v":142293.15,"d":"Fr. 142,293.15"}}]
[{"$nulls":5},"Auswählen",null,null,{"$f":"IF(G136=\"\",0,G136*VLOOKUP(F136,'Hilfstab Auswahl SOPÄ'!$O$6:$P$11,2,FALSE))","v":{"v":0,"d":"0.0%"}},0,{"v":0,"d":"0.0%"},null,null,"",null,{"$f":"IF(F136='Hilfstab Auswahl SOPÄ'!$O$8,ROUNDUP($E$9,0),IF(F136='Hilfstab Auswahl SOPÄ'!$O$9,ROUNDUP($E$10,0),IF(F136='Hilfstab Auswahl SOPÄ'!$O$10,ROUNDUP($E$11,0),$P$16)))","v":{"v":142293.15,"d":"Fr. 142,293.15"}}]
[{"$nulls":5},"Auswählen",null,null,{"$f":"IF(G137=\"\",0,G137*VLOOKUP(F137,'Hilfstab Auswahl SOPÄ'!$O$6:$P$11,2,FALSE))","v":{"v":0,"d":"0.0%"}},0,{"v":0,"d":"0.0%"},null,null,"",null,{"$f":"IF(F137='Hilfstab Auswahl SOPÄ'!$O$8,ROUNDUP($E$9,0),IF(F137='Hilfstab Auswahl SOPÄ'!$O$9,ROUNDUP($E$10,0),IF(F137='Hilfstab Auswahl SOPÄ'!$O$10,ROUNDUP($E$11,0),$P$16)))","v":{"v":142293.15,"d":"Fr. 142,293.15"}}]
[{"$nulls":5},"Auswählen",null,null,{"$f":"IF(G138=\"\",0,G138*VLOOKUP(F138,'Hilfstab Auswahl SOPÄ'!$O$6:$P$11,2,FALSE))","v":{"v":0,"d":"0.0%"}},0,{"v":0,"d":"0.0%"},null,null,"",null,{"$f":"IF(F138='Hilfstab Auswahl SOPÄ'!$O$8,ROUNDUP($E$9,0),IF(F138='Hilfstab Auswahl SOPÄ'!$O$9,ROUNDUP($E$10,0),IF(F138='Hilfstab Auswahl SOPÄ'!$O$10,ROUNDUP($E$11,0),$P$16)))","v":{"v":142293.15,"d":"Fr. 142,293.15"}}]
[{"$nulls":5},"Auswählen",null,null,{"$f":"IF(G139=\"\",0,G139*VLOOKUP(F139,'Hilfstab Auswahl SOPÄ'!$O$6:$P$11,2,FALSE))","v":{"v":0,"d":"0.0%"}},0,{"v":0,"d":"0.0%"},null,null,"",null,{"$f":"IF(F139='Hilfstab Auswahl SOPÄ'!$O$8,ROUNDUP($E$9,0),IF(F139='Hilfstab Auswahl SOPÄ'!$O$9,ROUNDUP($E$10,0),IF(F139='Hilfstab Auswahl SOPÄ'!$O$10,ROUNDUP($E$11,0),$P$16)))","v":{"v":142293.15,"d":"Fr. 142,293.15"}}]
[{"$nulls":5},"Auswählen",null,null,{"$f":"IF(G140=\"\",0,G140*VLOOKUP(F140,'Hilfstab Auswahl SOPÄ'!$O$6:$P$11,2,FALSE))","v":{"v":0,"d":"0.0%"}},0,{"v":0,"d":"0.0%"},null,null,"",null,{"$f":"IF(F140='Hilfstab Auswahl SOPÄ'!$O$8,ROUNDUP($E$9,0),IF(F140='Hilfstab Auswahl SOPÄ'!$O$9,ROUNDUP($E$10,0),IF(F140='Hilfstab Auswahl SOPÄ'!$O$10,ROUNDUP($E$11,0),$P$16)))","v":{"v":142293.15,"d":"Fr. 142,293.15"}}]
[{"$nulls":5},"Auswählen",null,null,{"$f":"IF(G141=\"\",0,G141*VLOOKUP(F141,'Hilfstab Auswahl SOPÄ'!$O$6:$P$11,2,FALSE))","v":{"v":0,"d":"0.0%"}},0,{"v":0,"d":"0.0%"},null,null,"",null,{"$f":"IF(F141='Hilfstab Auswahl SOPÄ'!$O$8,ROUNDUP($E$9,0),IF(F141='Hilfstab Auswahl SOPÄ'!$O$9,ROUNDUP($E$10,0),IF(F141='Hilfstab Auswahl SOPÄ'!$O$10,ROUNDUP($E$11,0),$P$16)))","v":{"v":142293.15,"d":"Fr. 142,293.15"}}]
[{"$nulls":5},"Auswählen",null,null,{"$f":"IF(G142=\"\",0,G142*VLOOKUP(F142,'Hilfstab Auswahl SOPÄ'!$O$6:$P$11,2,FALSE))","v":{"v":0,"d":"0.0%"}},0,{"v":0,"d":"0.0%"},null,null,"",null,{"$f":"IF(F142='Hilfstab Auswahl SOPÄ'!$O$8,ROUNDUP($E$9,0),IF(F142='Hilfstab Auswahl SOPÄ'!$O$9,ROUNDUP($E$10,0),IF(F142='Hilfstab Auswahl SOPÄ'!$O$10,ROUNDUP($E$11,0),$P$16)))","v":{"v":142293.15,"d":"Fr. 142,293.15"}}]
[{"$nulls":5},"Auswählen",null,null,{"$f":"IF(G143=\"\",0,G143*VLOOKUP(F143,'Hilfstab Auswahl SOPÄ'!$O$6:$P$11,2,FALSE))","v":{"v":0,"d":"0.0%"}},0,{"v":0,"d":"0.0%"},null,null,"",null,{"$f":"IF(F143='Hilfstab Auswahl SOPÄ'!$O$8,ROUNDUP($E$9,0),IF(F143='Hilfstab Auswahl SOPÄ'!$O$9,ROUNDUP($E$10,0),IF(F143='Hilfstab Auswahl SOPÄ'!$O$10,ROUNDUP($E$11,0),$P$16)))","v":{"v":142293.15,"d":"Fr. 142,293.15"}}]
[{"$nulls":5},"Auswählen",null,null,{"$f":"IF(G144=\"\",0,G144*VLOOKUP(F144,'Hilfstab Auswahl SOPÄ'!$O$6:$P$11,2,FALSE))","v":{"v":0,"d":"0.0%"}},0,{"v":0,"d":"0.0%"},null,null,"",null,{"$f":"IF(F144='Hilfstab Auswahl SOPÄ'!$O$8,ROUNDUP($E$9,0),IF(F144='Hilfstab Auswahl SOPÄ'!$O$9,ROUNDUP($E$10,0),IF(F144='Hilfstab Auswahl SOPÄ'!$O$10,ROUNDUP($E$11,0),$P$16)))","v":{"v":142293.15,"d":"Fr. 142,293.15"}}]
[{"$nulls":5},"Auswählen",null,null,{"$f":"IF(G145=\"\",0,G145*VLOOKUP(F145,'Hilfstab Auswahl SOPÄ'!$O$6:$P$11,2,FALSE))","v":{"v":0,"d":"0.0%"}},0,{"v":0,"d":"0.0%"},null,null,"",null,{"$f":"IF(F145='Hilfstab Auswahl SOPÄ'!$O$8,ROUNDUP($E$9,0),IF(F145='Hilfstab Auswahl SOPÄ'!$O$9,ROUNDUP($E$10,0),IF(F145='Hilfstab Auswahl SOPÄ'!$O$10,ROUNDUP($E$11,0),$P$16)))","v":{"v":142293.15,"d":"Fr. 142,293.15"}}]
[{"$nulls":5},"Auswählen",null,null,{"$f":"IF(G146=\"\",0,G146*VLOOKUP(F146,'Hilfstab Auswahl SOPÄ'!$O$6:$P$11,2,FALSE))","v":{"v":0,"d":"0.0%"}},0,{"v":0,"d":"0.0%"},null,null,"",null,{"$f":"IF(F146='Hilfstab Auswahl SOPÄ'!$O$8,ROUNDUP($E$9,0),IF(F146='Hilfstab Auswahl SOPÄ'!$O$9,ROUNDUP($E$10,0),IF(F146='Hilfstab Auswahl SOPÄ'!$O$10,ROUNDUP($E$11,0),$P$16)))","v":{"v":142293.15,"d":"Fr. 142,293.15"}}]
[{"$nulls":5},"Auswählen",null,null,{"$f":"IF(G147=\"\",0,G147*VLOOKUP(F147,'Hilfstab Auswahl SOPÄ'!$O$6:$P$11,2,FALSE))","v":{"v":0,"d":"0.0%"}},0,{"v":0,"d":"0.0%"},null,null,"",null,{"$f":"IF(F147='Hilfstab Auswahl SOPÄ'!$O$8,ROUNDUP($E$9,0),IF(F147='Hilfstab Auswahl SOPÄ'!$O$9,ROUNDUP($E$10,0),IF(F147='Hilfstab Auswahl SOPÄ'!$O$10,ROUNDUP($E$11,0),$P$16)))","v":{"v":142293.15,"d":"Fr. 142,293.15"}}]
[{"$nulls":5},"Auswählen",null,null,{"$f":"IF(G148=\"\",0,G148*VLOOKUP(F148,'Hilfstab Auswahl SOPÄ'!$O$6:$P$11,2,FALSE))","v":{"v":0,"d":"0.0%"}},{"$f":"IF(G148=0,0,H148/G148*100%)","v":0},{"$f":"IF(L148=\"ja\",G148,0)","v":{"v":0,"d":"0.0%"}},null,null,"",null,{"$f":"IF(F148='Hilfstab Auswahl SOPÄ'!$O$8,ROUNDUP($E$9,0),IF(F148='Hilfstab Auswahl SOPÄ'!$O$9,ROUNDUP($E$10,0),IF(F148='Hilfstab Auswahl SOPÄ'!$O$10,ROUNDUP($E$11,0),$P$16)))","v":{"v":142293.15,"d":"Fr. 142,293.15"}}]
[{"$nulls":5},"Auswählen",null,null,{"$f":"IF(G149=\"\",0,G149*VLOOKUP(F149,'Hilfstab Auswahl SOPÄ'!$O$6:$P$11,2,FALSE))","v":{"v":0,"d":"0.0%"}},0,{"v":0,"d":"0.0%"},null,null,"",null,{"$f":"IF(F149='Hilfstab Auswahl SOPÄ'!$O$8,ROUNDUP($E$9,0),IF(F149='Hilfstab Auswahl SOPÄ'!$O$9,ROUNDUP($E$10,0),IF(F149='Hilfstab Auswahl SOPÄ'!$O$10,ROUNDUP($E$11,0),$P$16)))","v":{"v":142293.15,"d":"Fr. 142,293.15"}}]
[{"$nulls":5},"Auswählen",null,null,{"$f":"IF(G150=\"\",0,G150*VLOOKUP(F150,'Hilfstab Auswahl SOPÄ'!$O$6:$P$11,2,FALSE))","v":{"v":0,"d":"0.0%"}},0,{"v":0,"d":"0.0%"},null,null,"",null,{"$f":"IF(F150='Hilfstab Auswahl SOPÄ'!$O$8,ROUNDUP($E$9,0),IF(F150='Hilfstab Auswahl SOPÄ'!$O$9,ROUNDUP($E$10,0),IF(F150='Hilfstab Auswahl SOPÄ'!$O$10,ROUNDUP($E$11,0),$P$16)))","v":{"v":142293.15,"d":"Fr. 142,293.15"}}]
[{"$nulls":5},"Auswählen",null,null,{"$f":"IF(G151=\"\",0,G151*VLOOKUP(F151,'Hilfstab Auswahl SOPÄ'!$O$6:$P$11,2,FALSE))","v":{"v":0,"d":"0.0%"}},0,{"v":0,"d":"0.0%"},null,null,"",null,{"$f":"IF(F151='Hilfstab Auswahl SOPÄ'!$O$8,ROUNDUP($E$9,0),IF(F151='Hilfstab Auswahl SOPÄ'!$O$9,ROUNDUP($E$10,0),IF(F151='Hilfstab Auswahl SOPÄ'!$O$10,ROUNDUP($E$11,0),$P$16)))","v":{"v":142293.15,"d":"Fr. 142,293.15"}}]
[{"$nulls":5},"Auswählen",null,null,{"$f":"IF(G152=\"\",0,G152*VLOOKUP(F152,'Hilfstab Auswahl SOPÄ'!$O$6:$P$11,2,FALSE))","v":{"v":0,"d":"0.0%"}},0,{"v":0,"d":"0.0%"},null,null,"",null,{"$f":"IF(F152='Hilfstab Auswahl SOPÄ'!$O$8,ROUNDUP($E$9,0),IF(F152='Hilfstab Auswahl SOPÄ'!$O$9,ROUNDUP($E$10,0),IF(F152='Hilfstab Auswahl SOPÄ'!$O$10,ROUNDUP($E$11,0),$P$16)))","v":{"v":142293.15,"d":"Fr. 142,293.15"}}]
[{"$nulls":5},"Auswählen",null,null,{"$f":"IF(G153=\"\",0,G153*VLOOKUP(F153,'Hilfstab Auswahl SOPÄ'!$O$6:$P$11,2,FALSE))","v":{"v":0,"d":"0.0%"}},0,{"v":0,"d":"0.0%"},null,null,"",null,{"$f":"IF(F153='Hilfstab Auswahl SOPÄ'!$O$8,ROUNDUP($E$9,0),IF(F153='Hilfstab Auswahl SOPÄ'!$O$9,ROUNDUP($E$10,0),IF(F153='Hilfstab Auswahl SOPÄ'!$O$10,ROUNDUP($E$11,0),$P$16)))","v":{"v":142293.15,"d":"Fr. 142,293.15"}}]
[{"$nulls":5},"Auswählen",null,null,{"$f":"IF(G154=\"\",0,G154*VLOOKUP(F154,'Hilfstab Auswahl SOPÄ'!$O$6:$P$11,2,FALSE))","v":{"v":0,"d":"0.0%"}},0,{"v":0,"d":"0.0%"},null,null,"",null,{"$f":"IF(F154='Hilfstab Auswahl SOPÄ'!$O$8,ROUNDUP($E$9,0),IF(F154='Hilfstab Auswahl SOPÄ'!$O$9,ROUNDUP($E$10,0),IF(F154='Hilfstab Auswahl SOPÄ'!$O$10,ROUNDUP($E$11,0),$P$16)))","v":{"v":142293.15,"d":"Fr. 142,293.15"}}]
[{"$nulls":5},"Auswählen",null,null,{"$f":"IF(G155=\"\",0,G155*VLOOKUP(F155,'Hilfstab Auswahl SOPÄ'!$O$6:$P$11,2,FALSE))","v":{"v":0,"d":"0.0%"}},0,{"v":0,"d":"0.0%"},null,null,"",null,{"$f":"IF(F155='Hilfstab Auswahl SOPÄ'!$O$8,ROUNDUP($E$9,0),IF(F155='Hilfstab Auswahl SOPÄ'!$O$9,ROUNDUP($E$10,0),IF(F155='Hilfstab Auswahl SOPÄ'!$O$10,ROUNDUP($E$11,0),$P$16)))","v":{"v":142293.15,"d":"Fr. 142,293.15"}}]
[{"$nulls":5},"Auswählen",null,null,{"$f":"IF(G156=\"\",0,G156*VLOOKUP(F156,'Hilfstab Auswahl SOPÄ'!$O$6:$P$11,2,FALSE))","v":{"v":0,"d":"0.0%"}},0,{"v":0,"d":"0.0%"},null,null,"",null,{"$f":"IF(F156='Hilfstab Auswahl SOPÄ'!$O$8,ROUNDUP($E$9,0),IF(F156='Hilfstab Auswahl SOPÄ'!$O$9,ROUNDUP($E$10,0),IF(F156='Hilfstab Auswahl SOPÄ'!$O$10,ROUNDUP($E$11,0),$P$16)))","v":{"v":142293.15,"d":"Fr. 142,293.15"}}]
[{"$nulls":5},"Auswählen",null,null,{"$f":"IF(G157=\"\",0,G157*VLOOKUP(F157,'Hilfstab Auswahl SOPÄ'!$O$6:$P$11,2,FALSE))","v":{"v":0,"d":"0.0%"}},0,{"v":0,"d":"0.0%"},null,null,"",null,{"$f":"IF(F157='Hilfstab Auswahl SOPÄ'!$O$8,ROUNDUP($E$9,0),IF(F157='Hilfstab Auswahl SOPÄ'!$O$9,ROUNDUP($E$10,0),IF(F157='Hilfstab Auswahl SOPÄ'!$O$10,ROUNDUP($E$11,0),$P$16)))","v":{"v":142293.15,"d":"Fr. 142,293.15"}}]
[{"$nulls":5},"Auswählen",null,null,{"$f":"IF(G158=\"\",0,G158*VLOOKUP(F158,'Hilfstab Auswahl SOPÄ'!$O$6:$P$11,2,FALSE))","v":{"v":0,"d":"0.0%"}},0,{"v":0,"d":"0.0%"},null,null,"",null,{"$f":"IF(F158='Hilfstab Auswahl SOPÄ'!$O$8,ROUNDUP($E$9,0),IF(F158='Hilfstab Auswahl SOPÄ'!$O$9,ROUNDUP($E$10,0),IF(F158='Hilfstab Auswahl SOPÄ'!$O$10,ROUNDUP($E$11,0),$P$16)))","v":{"v":142293.15,"d":"Fr. 142,293.15"}}]
[{"$nulls":5},"Auswählen",null,null,{"$f":"IF(G159=\"\",0,G159*VLOOKUP(F159,'Hilfstab Auswahl SOPÄ'!$O$6:$P$11,2,FALSE))","v":{"v":0,"d":"0.0%"}},0,{"v":0,"d":"0.0%"},null,null,"",null,{"$f":"IF(F159='Hilfstab Auswahl SOPÄ'!$O$8,ROUNDUP($E$9,0),IF(F159='Hilfstab Auswahl SOPÄ'!$O$9,ROUNDUP($E$10,0),IF(F159='Hilfstab Auswahl SOPÄ'!$O$10,ROUNDUP($E$11,0),$P$16)))","v":{"v":142293.15,"d":"Fr. 142,293.15"}}]
[{"$nulls":5},"Auswählen",null,null,{"$f":"IF(G160=\"\",0,G160*VLOOKUP(F160,'Hilfstab Auswahl SOPÄ'!$O$6:$P$11,2,FALSE))","v":{"v":0,"d":"0.0%"}},0,{"v":0,"d":"0.0%"},null,null,"",null,{"$f":"IF(F160='Hilfstab Auswahl SOPÄ'!$O$8,ROUNDUP($E$9,0),IF(F160='Hilfstab Auswahl SOPÄ'!$O$9,ROUNDUP($E$10,0),IF(F160='Hilfstab Auswahl SOPÄ'!$O$10,ROUNDUP($E$11,0),$P$16)))","v":{"v":142293.15,"d":"Fr. 142,293.15"}}]
[{"$nulls":5},"Auswählen",null,null,{"$f":"IF(G161=\"\",0,G161*VLOOKUP(F161,'Hilfstab Auswahl SOPÄ'!$O$6:$P$11,2,FALSE))","v":{"v":0,"d":"0.0%"}},0,{"v":0,"d":"0.0%"},null,null,"",null,{"$f":"IF(F161='Hilfstab Auswahl SOPÄ'!$O$8,ROUNDUP($E$9,0),IF(F161='Hilfstab Auswahl SOPÄ'!$O$9,ROUNDUP($E$10,0),IF(F161='Hilfstab Auswahl SOPÄ'!$O$10,ROUNDUP($E$11,0),$P$16)))","v":{"v":142293.15,"d":"Fr. 142,293.15"}}]
[{"$nulls":5},"Auswählen",null,null,{"$f":"IF(G162=\"\",0,G162*VLOOKUP(F162,'Hilfstab Auswahl SOPÄ'!$O$6:$P$11,2,FALSE))","v":{"v":0,"d":"0.0%"}},0,{"v":0,"d":"0.0%"},null,null,"",null,{"$f":"IF(F162='Hilfstab Auswahl SOPÄ'!$O$8,ROUNDUP($E$9,0),IF(F162='Hilfstab Auswahl SOPÄ'!$O$9,ROUNDUP($E$10,0),IF(F162='Hilfstab Auswahl SOPÄ'!$O$10,ROUNDUP($E$11,0),$P$16)))","v":{"v":142293.15,"d":"Fr. 142,293.15"}}]
[{"$nulls":5},"Auswählen",null,null,{"$f":"IF(G163=\"\",0,G163*VLOOKUP(F163,'Hilfstab Auswahl SOPÄ'!$O$6:$P$11,2,FALSE))","v":{"v":0,"d":"0.0%"}},0,{"v":0,"d":"0.0%"},null,null,"",null,{"$f":"IF(F163='Hilfstab Auswahl SOPÄ'!$O$8,ROUNDUP($E$9,0),IF(F163='Hilfstab Auswahl SOPÄ'!$O$9,ROUNDUP($E$10,0),IF(F163='Hilfstab Auswahl SOPÄ'!$O$10,ROUNDUP($E$11,0),$P$16)))","v":{"v":142293.15,"d":"Fr. 142,293.15"}}]
[{"$nulls":5},"Auswählen",null,null,{"$f":"IF(G164=\"\",0,G164*VLOOKUP(F164,'Hilfstab Auswahl SOPÄ'!$O$6:$P$11,2,FALSE))","v":{"v":0,"d":"0.0%"}},0,{"v":0,"d":"0.0%"},null,null,"",null,{"$f":"IF(F164='Hilfstab Auswahl SOPÄ'!$O$8,ROUNDUP($E$9,0),IF(F164='Hilfstab Auswahl SOPÄ'!$O$9,ROUNDUP($E$10,0),IF(F164='Hilfstab Auswahl SOPÄ'!$O$10,ROUNDUP($E$11,0),$P$16)))","v":{"v":142293.15,"d":"Fr. 142,293.15"}}]
[{"$nulls":5},"Auswählen",null,null,{"$f":"IF(G165=\"\",0,G165*VLOOKUP(F165,'Hilfstab Auswahl SOPÄ'!$O$6:$P$11,2,FALSE))","v":{"v":0,"d":"0.0%"}},0,{"v":0,"d":"0.0%"},null,null,"",null,{"$f":"IF(F165='Hilfstab Auswahl SOPÄ'!$O$8,ROUNDUP($E$9,0),IF(F165='Hilfstab Auswahl SOPÄ'!$O$9,ROUNDUP($E$10,0),IF(F165='Hilfstab Auswahl SOPÄ'!$O$10,ROUNDUP($E$11,0),$P$16)))","v":{"v":142293.15,"d":"Fr. 142,293.15"}}]
[{"$nulls":5},"Auswählen",null,null,{"$f":"IF(G166=\"\",0,G166*VLOOKUP(F166,'Hilfstab Auswahl SOPÄ'!$O$6:$P$11,2,FALSE))","v":{"v":0,"d":"0.0%"}},0,{"v":0,"d":"0.0%"},null,null,"",null,{"$f":"IF(F166='Hilfstab Auswahl SOPÄ'!$O$8,ROUNDUP($E$9,0),IF(F166='Hilfstab Auswahl SOPÄ'!$O$9,ROUNDUP($E$10,0),IF(F166='Hilfstab Auswahl SOPÄ'!$O$10,ROUNDUP($E$11,0),$P$16)))","v":{"v":142293.15,"d":"Fr. 142,293.15"}}]
[{"$nulls":5},"Auswählen",null,null,{"$f":"IF(G167=\"\",0,G167*VLOOKUP(F167,'Hilfstab Auswahl SOPÄ'!$O$6:$P$11,2,FALSE))","v":{"v":0,"d":"0.0%"}},0,{"v":0,"d":"0.0%"},null,null,"",null,{"$f":"IF(F167='Hilfstab Auswahl SOPÄ'!$O$8,ROUNDUP($E$9,0),IF(F167='Hilfstab Auswahl SOPÄ'!$O$9,ROUNDUP($E$10,0),IF(F167='Hilfstab Auswahl SOPÄ'!$O$10,ROUNDUP($E$11,0),$P$16)))","v":{"v":142293.15,"d":"Fr. 142,293.15"}}]
[{"$nulls":5},"Auswählen",null,null,{"$f":"IF(G168=\"\",0,G168*VLOOKUP(F168,'Hilfstab Auswahl SOPÄ'!$O$6:$P$11,2,FALSE))","v":{"v":0,"d":"0.0%"}},0,{"v":0,"d":"0.0%"},null,null,"",null,{"$f":"IF(F168='Hilfstab Auswahl SOPÄ'!$O$8,ROUNDUP($E$9,0),IF(F168='Hilfstab Auswahl SOPÄ'!$O$9,ROUNDUP($E$10,0),IF(F168='Hilfstab Auswahl SOPÄ'!$O$10,ROUNDUP($E$11,0),$P$16)))","v":{"v":142293.15,"d":"Fr. 142,293.15"}}]

{"sheet":"D","index":4,"n_rows":693,"n_cols":13,"rows_kept":693,"merged":[[5,2,5,5],[7,0,9,5]]}
[{"$f":"\"Pensenplan \"&Zusammenzug!B6","v":"Pensenplan "}]
["Beilage zum Pensenplan: Grundlage für die Aufsicht"]
[]
["Schuljahr",null,{"$f":"Zusammenzug!B4","v":2024}]
[]
["Sonderschule",null,{"$f":"+Zusammenzug!B6","v":0}]
[]
["In der Grundlage sind die Pensen in Lektionen aller angestellten Personen aufzuführen, die in einer Klasse tätig sind. Nicht aufgeführt werden externe Fachpersonen (z.B. B&U-Dienste, externe Logopädie). Jede hier aufgeführte Lehrperson, Psychomotorik- oder Logopädie-Therapeut/in muss auf B eingetragen sein."]
[]
[]
[]
["Stufe",null,"Funktion","Nachname","Vorname","Lektionen",null,"Funktion (BFS)","Kommentar für Statistik",null,null,"UnterrichtsstufeKlasse","Standort"]
[]
[null,"Anzahl\nSuS"]
[{"$f":"+A!A28","v":{"v":0,"d":"0.0"}},{"$f":"+A!I28","v":0},{"$nulls":5},"Auswählen",{"$nulls":3},{"$f":"IF(H15=\"nicht statistikpflichtig\",\"nicht statistikpflichtig\",IF(H15=\"Auswählen\",\"\",A$19))","v":""},{"$f":"IF(H15=\"nicht statistikpflichtig\",\"nicht statistikpflichtig\",IF(H15=\"Auswählen\",\"\",A$21))","v":""}]
[{"$f":"+A!A29","v":{"v":0,"d":"0.0"}},{"$nulls":6},"Auswählen",{"$nulls":3},{"$f":"IF(H16=\"nicht statistikpflichtig\",\"nicht statistikpflichtig\",IF(H16=\"Auswählen\",\"\",A$19))","v":""},{"$f":"IF(H16=\"nicht statistikpflichtig\",\"nicht statistikpflichtig\",IF(H16=\"Auswählen\",\"\",A$21))","v":""}]
[{"$f":"+A!A30","v":{"v":0,"d":"0.0"}},{"$nulls":6},"Auswählen",{"$nulls":3},"",""]
["Unterrichtsstufe der Klasse",{"$nulls":6},"Auswählen",{"$nulls":3},"",""]
["Auswählen",{"$nulls":6},"Auswählen",{"$nulls":3},{"$f":"IF(H19=\"nicht statistikpflichtig\",\"nicht statistikpflichtig\",IF(H19=\"Auswählen\",\"\",A$19))","v":""},""]
["Standort der Klasse",{"$nulls":6},"Auswählen",{"$nulls":3},"",""]
["Auswählen",{"$nulls":6},"Auswählen",{"$nulls":3},"",""]
[{"$nulls":7},"Auswählen",{"$nulls":3},"",""]
[{"$nulls":7},"Auswählen",{"$nulls":3},"",""]
[{"$nulls":7},"Auswählen",{"$nulls":3},"",""]
[{"$nulls":7},"Auswählen",{"$nulls":3},"",""]
[{"$nulls":7},"Auswählen",{"$nulls":3},"",""]
[{"$nulls":7},"Auswählen",{"$nulls":3},"",""]
[{"$nulls":7},"Auswählen",{"$nulls":3},"",""]
[{"$nulls":7},"Auswählen",{"$nulls":3},"",""]
[null,null,"Total",null,null,{"$f":"SUM(F15:F29)","v":{"v":0,"d":"0.0"}}]
[]
[{"$f":"+A!A32","v":{"v":0,"d":"0.0"}},{"$f":"+A!I32","v":0},{"$nulls":5},"Auswählen",{"$nulls":3},{"$f":"IF(H32=\"nicht statistikpflichtig\",\"nicht statistikpflichtig\",IF(H32=\"Auswählen\",\"\",A$36))","v":""},{"$f":"IF(H32=\"nicht statistikpflichtig\",\"nicht statistikpflichtig\",IF(H32=\"Auswählen\",\"\",A$38))","v":""}]
[{"$f":"+A!A33","v":{"v":0,"d":"0.0"}},{"$nulls":6},"Auswählen",{"$nulls":3},{"$f":"IF(H33=\"nicht statistikpflichtig\",\"nicht statistikpflichtig\",IF(H33=\"Auswählen\",\"\",A$36))","v":""},{"$f":"IF(H33=\"nicht statistikpflichtig\",\"nicht statistikpflichtig\",IF(H33=\"Auswählen\",\"\",A$38))","v":""}]
[{"$f":"+A!A34","v":{"v":0,"d":"0.0"}},{"$nulls":6},"Auswählen",{"$nulls":3},{"$f":"IF(H34=\"nicht statistikpflichtig\",\"nicht statistikpflichtig\",IF(H34=\"Auswählen\",\"\",A$36))","v":""},""]
["Unterrichtsstufe der Klasse",{"$nulls":6},"Auswählen",{"$nulls":3},{"$f":"IF(H35=\"nicht statistikpflichtig\",\"nicht statistikpflichtig\",IF(H35=\"Auswählen\",\"\",A$36))","v":""},""]
["Auswählen",{"$nulls":6},"Auswählen",{"$nulls":3},"",""]
["Standort der Klasse",{"$nulls":6},"Auswählen",{"$nulls":3},"",""]
["Auswählen",{"$nulls":6},"Auswählen",{"$nulls":3},"",""]
[{"$nulls":7},"Auswählen",{"$nulls":3},"",""]
[{"$nulls":7},"Auswählen",{"$nulls":3},"",""]
[{"$nulls":7},"Auswählen",{"$nulls":3},"",""]
[{"$nulls":7},"Auswählen",{"$nulls":3},"",""]
[{"$nulls":7},"Auswählen",{"$nulls":3},"",""]
[{"$nulls":7},"Auswählen",{"$nulls":3},"",""]
[{"$nulls":7},"Auswählen",{"$nulls":3},"",""]
[{"$nulls":7},"Auswählen",{"$nulls":3},"",""]
[null,null,"Total",null,null,{"$f":"SUM(F32:F46)","v":{"v":0,"d":"0.0"}}]
[]
[{"$f":"+A!A36","v":{"v":0,"d":"0.0"}},{"$f":"+A!I36","v":0},{"$nulls":5},"Auswählen",{"$nulls":3},{"$f":"IF(H49=\"nicht statistikpflichtig\",\"nicht statistikpflichtig\",IF(H49=\"Auswählen\",\"\",A$53))","v":""},{"$f":"IF(H49=\"nicht statistikpflichtig\",\"nicht statistikpflichtig\",IF(H49=\"Auswählen\",\"\",A$55))","v":""}]
[{"$f":"+A!A37","v":{"v":0,"d":"0.0"}},{"$nulls":6},"Auswählen",{"$nulls":3},{"$f":"IF(H50=\"nicht statistikpflichtig\",\"nicht statistikpflichtig\",IF(H50=\"Auswählen\",\"\",A$53))","v":""},{"$f":"IF(H50=\"nicht statistikpflichtig\",\"nicht statistikpflichtig\",IF(H50=\"Auswählen\",\"\",A$55))","v":""}]
[{"$f":"+A!A38","v":{"v":0,"d":"0.0"}},{"$nulls":6},"Auswählen",{"$nulls":3},"",""]
["Unterrichtsstufe der Klasse",{"$nulls":6},"Auswählen",{"$nulls":3},"",""]
["Auswählen",{"$nulls":6},"Auswählen",{"$nulls":3},"",""]
["Standort der Klasse",{"$nulls":6},"Auswählen",{"$nulls":3},"",""]
["Auswählen",{"$nulls":6},"Auswählen",{"$nulls":3},"",""]
[{"$nulls":7},"Auswählen",{"$nulls":3},"",""]
[{"$nulls":7},"Auswählen",{"$nulls":3},"",""]
[{"$nulls":7},"Auswählen",{"$nulls":3},"",""]
[{"$nulls":7},"Auswählen",{"$nulls":3},"",""]
[{"$nulls":7},"Auswählen",{"$nulls":3},"",""]
[{"$nulls":7},"Auswählen",{"$nulls":3},"",""]
[{"$nulls":7},"Auswählen",{"$nulls":3},"",""]
[{"$nulls":7},"Auswählen",{"$nulls":3},"",""]
[null,null,"Total",null,null,{"$f":"SUM(F49:F63)","v":{"v":0,"d":"0.0"}}]
[]
[{"$f":"+A!A40","v":{"v":0,"d":"0.0"}},{"$f":"+A!I40","v":0},{"$nulls":5},"Auswählen",{"$nulls":3},{"$f":"IF(H66=\"nicht statistikpflichtig\",\"nicht statistikpflichtig\",IF(H66=\"Auswählen\",\"\",A$70))","v":""},{"$f":"IF(H66=\"nicht statistikpflichtig\",\"nicht statistikpflichtig\",IF(H66=\"Auswählen\",\"\",A$72))","v":""}]
[{"$f":"+A!A41","v":{"v":0,"d":"0.0"}},{"$nulls":6},"Auswählen",{"$nulls":3},{"$f":"IF(H67=\"nicht statistikpflichtig\",\"nicht statistikpflichtig\",IF(H67=\"Auswählen\",\"\",A$70))","v":""},{"$f":"IF(H67=\"nicht statistikpflichtig\",\"nicht statistikpflichtig\",IF(H67=\"Auswählen\",\"\",A$72))","v":""}]
[{"$f":"+A!A42","v":{"v":0,"d":"0.0"}},{"$nulls":6},"Auswählen",{"$nulls":3},{"$f":"IF(H68=\"nicht statistikpflichtig\",\"nicht statistikpflichtig\",IF(H68=\"Auswählen\",\"\",A$70))","v":""},""]
["Unterrichtsstufe der Klasse",{"$nulls":6},"Auswählen",{"$nulls":3},"",""]
["Auswählen",{"$nulls":6},"Auswählen",{"$nulls":3},"",""]
["Standort der Klasse",{"$nulls":6},"Auswählen",{"$nulls":3},"",""]
["Auswählen",{"$nulls":6},"Auswählen",{"$nulls":3},"",""]
[{"$nulls":7},"Auswählen",{"$nulls":3},"",""]
[{"$nulls":7},"Auswählen",{"$nulls":3},"",""]
[{"$nulls":7},"Auswählen",{"$nulls":3},"",""]
[{"$nulls":7},"Auswählen",{"$nulls":3},"",""]
[{"$nulls":7},"Auswählen",{"$nulls":3},"",""]
[{"$nulls":7},"Auswählen",{"$nulls":3},"",""]
[{"$nulls":7},"Auswählen",{"$nulls":3},"",""]
[{"$nulls":7},"Auswählen",{"$nulls":3},"",""]
[null,null,"Total",null,null,{"$f":"SUM(F66:F80)","v":{"v":0,"d":"0.0"}}]
[]
[{"$f":"+A!A44","v":{"v":0,"d":"0.0"}},{"$f":"+A!I44","v":0},"Klassenlehrer/in",{"$nulls":4},"Auswählen",{"$nulls":3},{"$f":"IF(H83=\"nicht statistikpflichtig\",\"nicht statistikpflichtig\",IF(H83=\"Auswählen\",\"\",A$87))","v":""},{"$f":"IF(H83=\"nicht statistikpflichtig\",\"nicht statistikpflichtig\",IF(H83=\"Auswählen\",\"\",A$89))","v":""}]
[{"$f":"+A!A45","v":{"v":0,"d":"0.0"}},{"$nulls":6},"Auswählen",{"$nulls":3},{"$f":"IF(H84=\"nicht statistikpflichtig\",\"nicht statistikpflichtig\",IF(H84=\"Auswählen\",\"\",A$87))","v":""},{"$f":"IF(H84=\"nicht statistikpflichtig\",\"nicht statistikpflichtig\",IF(H84=\"Auswählen\",\"\",A$89))","v":""}]
[{"$f":"+A!A46","v":{"v":0,"d":"0.0"}},{"$nulls":6},"Auswählen",{"$nulls":3},{"$f":"IF(H85=\"nicht statistikpflichtig\",\"nicht statistikpflichtig\",IF(H85=\"Auswählen\",\"\",A$87))","v":""},""]
["Unterrichtsstufe der Klasse",{"$nulls":6},"Auswählen",{"$nulls":3},"",""]
["Auswählen",{"$nulls":6},"Auswählen",{"$nulls":3},"",""]
["Standort der Klasse",{"$nulls":6},"Auswählen",{"$nulls":3},"",""]
["Auswählen",{"$nulls":6},"Auswählen",{"$nulls":3},"",""]
[{"$nulls":7},"Auswählen",{"$nulls":3},"",""]
[{"$nulls":7},"Auswählen",{"$nulls":3},"",""]
[{"$nulls":7},"Auswählen",{"$nulls":3},"",""]
[{"$nulls":7},"Auswählen",{"$nulls":3},"",""]
[{"$nulls":7},"Auswählen",{"$nulls":3},"",""]
[{"$nulls":7},"Auswählen",{"$nulls":3},"",""]
[{"$nulls":7},"Auswählen",{"$nulls":3},"",""]
[{"$nulls":7},"Auswählen",{"$nulls":3},"",""]
[null,null,"Total",null,null,{"$f":"SUM(F83:F97)","v":{"v":0,"d":"0.0"}}]
[]
[{"$f":"+A!A48","v":{"v":0,"d":"0.0"}},{"$f":"+A!I48","v":0},"Klassenlehrer/in",{"$nulls":4},"Auswählen",{"$nulls":3},{"$f":"IF(H100=\"nicht statistikpflichtig\",\"nicht statistikpflichtig\",IF(H100=\"Auswählen\",\"\",A$104))","v":""},{"$f":"IF(H100=\"nicht statistikpflichtig\",\"nicht statistikpflichtig\",IF(H100=\"Auswählen\",\"\",A$106))","v":""}]
[{"$f":"+A!A49","v":{"v":0,"d":"0.0"}},{"$nulls":6},"Auswählen",{"$nulls":3},{"$f":"IF(H101=\"nicht statistikpflichtig\",\"nicht statistikpflichtig\",IF(H101=\"Auswählen\",\"\",A$104))","v":""},{"$f":"IF(H101=\"nicht statistikpflichtig\",\"nicht statistikpflichtig\",IF(H101=\"Auswählen\",\"\",A$106))","v":""}]
[{"$f":"+A!A50","v":{"v":0,"d":"0.0"}},{"$nulls":6},"Auswählen",{"$nulls":3},"",""]
["Unterrichtsstufe der Klasse",{"$nulls":6},"Auswählen",{"$nulls":3},"",""]
["Auswählen",{"$nulls":6},"Auswählen",{"$nulls":3},"",""]
["Standort der Klasse",{"$nulls":6},"Auswählen",{"$nulls":3},"",""]
["Auswählen",{"$nulls":6},"Auswählen",{"$nulls":3},"",""]
[{"$nulls":7},"Auswählen",{"$nulls":3},"",""]
[{"$nulls":7},"Auswählen",{"$nulls":3},"",""]
[{"$nulls":7},"Auswählen",{"$nulls":3},"",""]
[{"$nulls":7},"Auswählen",{"$nulls":3},"",""]
[{"$nulls":7},"Auswählen",{"$nulls":3},"",""]
[{"$nulls":7},"Auswählen",{"$nulls":3},"",""]
[{"$nulls":7},"Auswählen",{"$nulls":3},"",""]
[{"$nulls":7},"Auswählen",{"$nulls":3},"",""]
[null,null,"Total",null,null,{"$f":"SUM(F100:F114)","v":{"v":0,"d":"0.0"}}]
[]
[{"$f":"+A!A52","v":{"v":0,"d":"0.0"}},{"$f":"+A!I52","v":0},"Klassenlehrer/in",{"$nulls":4},"Auswählen",{"$nulls":3},{"$f":"IF(H117=\"nicht statistikpflichtig\",\"nicht statistikpflichtig\",IF(H117=\"Auswählen\",\"\",A$121))","v":""},{"$f":"IF(H117=\"nicht statistikpflichtig\",\"nicht statistikpflichtig\",IF(H117=\"Auswählen\",\"\",A$123))","v":""}]
[{"$f":"+A!A53","v":{"v":0,"d":"0.0"}},{"$nulls":6},"Auswählen",{"$nulls":3},{"$f":"IF(H118=\"nicht statistikpflichtig\",\"nicht statistikpflichtig\",IF(H118=\"Auswählen\",\"\",A$121))","v":""},{"$f":"IF(H118=\"nicht statistikpflichtig\",\"nicht statistikpflichtig\",IF(H118=\"Auswählen\",\"\",A$123))","v":""}]
[{"$f":"+A!A54","v":{"v":0,"d":"0.0"}},{"$nulls":6},"Auswählen",{"$nulls":3},"",""]
["Unterrichtsstufe der Klasse",{"$nulls":6},"Auswählen",{"$nulls":3},"",""]
["Auswählen",{"$nulls":6},"Auswählen",{"$nulls":3},"",""]
["Standort der Klasse",{"$nulls":6},"Auswählen",{"$nulls":3},"",""]
["Auswählen",{"$nulls":6},"Auswählen",{"$nulls":3},"",""]
[{"$nulls":7},"Auswählen",{"$nulls":3},"",""]
[{"$nulls":7},"Auswählen",{"$nulls":3},"",""]
[{"$nulls":7},"Auswählen",{"$nulls":3},"",""]
[{"$nulls":7},"Auswählen",{"$nulls":3},"",""]
[{"$nulls":7},"Auswählen",{"$nulls":3},"",""]
[{"$nulls":7},"Auswählen",{"$nulls":3},"",""]
[{"$nulls":7},"Auswählen",{"$nulls":3},"",""]
[{"$nulls":7},"Auswählen",{"$nulls":3},"",""]
[null,null,"Total",null,null,{"$f":"SUM(F117:F131)","v":{"v":0,"d":"0.0"}}]
[]
[{"$f":"+A!A56","v":{"v":0,"d":"0.0"}},{"$f":"+A!I56","v":0},"Klassenlehrer/in",{"$nulls":4},"Auswählen",{"$nulls":3},{"$f":"IF(H134=\"nicht statistikpflichtig\",\"nicht statistikpflichtig\",IF(H134=\"Auswählen\",\"\",A$138))","v":""},{"$f":"IF(H134=\"nicht statistikpflichtig\",\"nicht statistikpflichtig\",IF(H134=\"Auswählen\",\"\",A$140))","v":""}]
[{"$f":"+A!A57","v":{"v":0,"d":"0.0"}},{"$nulls":6},"Auswählen",{"$nulls":3},{"$f":"IF(H135=\"nicht statistikpflichtig\",\"nicht statistikpflichtig\",IF(H135=\"Auswählen\",\"\",A$138))","v":""},{"$f":"IF(H135=\"nicht statistikpflichtig\",\"nicht statistikpflichtig\",IF(H135=\"Auswählen\",\"\",A$140))","v":""}]
[{"$f":"+A!A58","v":{"v":0,"d":"0.0"}},{"$nulls":6},"Auswählen",{"$nulls":3},"",""]
["Unterrichtsstufe der Klasse",{"$nulls":6},"Auswählen",{"$nulls":3},"",""]
["Auswählen",{"$nulls":6},"Auswählen",{"$nulls":3},"",""]
["Standort der Klasse",{"$nulls":6},"Auswählen",{"$nulls":3},"",""]
["Auswählen",{"$nulls":6},"Auswählen",{"$nulls":3},"",""]
[{"$nulls":7},"Auswählen",{"$nulls":3},"",""]
[{"$nulls":7},"Auswählen",{"$nulls":3},"",""]
[{"$nulls":7},"Auswählen",{"$nulls":3},"",""]
[{"$nulls":7},"Auswählen",{"$nulls":3},"",""]
[{"$nulls":7},"Auswählen",{"$nulls":3},"",""]
[{"$nulls":7},"Auswählen",{"$nulls":3},"",""]
[{"$nulls":7},"Auswählen",{"$nulls":3},"",""]
[{"$nulls":7},"Auswählen",{"$nulls":3},"",""]
[null,null,"Total",null,null,{"$f":"SUM(F134:F148)","v":{"v":0,"d":"0.0"}}]
[]
[{"$f":"+A!A60","v":{"v":0,"d":"0.0"}},{"$f":"+A!I60","v":0},"Klassenlehrer/in",{"$nulls":4},"Auswählen",{"$nulls":3},{"$f":"IF(H151=\"nicht statistikpflichtig\",\"nicht statistikpflichtig\",IF(H151=\"Auswählen\",\"\",A$155))","v":""},{"$f":"IF(H151=\"nicht statistikpflichtig\",\"nicht statistikpflichtig\",IF(H151=\"Auswählen\",\"\",A$157))","v":""}]
[{"$f":"+A!A61","v":{"v":0,"d":"0.0"}},{"$nulls":6},"Auswählen",{"$nulls":3},{"$f":"IF(H152=\"nicht statistikpflichtig\",\"nicht statistikpflichtig\",IF(H152=\"Auswählen\",\"\",A$155))","v":""},{"$f":"IF(H152=\"nicht statistikpflichtig\",\"nicht statistikpflichtig\",IF(H152=\"Auswählen\",\"\",A$157))","v":""}]
[{"$f":"+A!A62","v":{"v":0,"d":"0.0"}},{"$nulls":6},"Auswählen",{"$nulls":3},"",""]
["Unterrichtsstufe der Klasse",{"$nulls":6},"Auswählen",{"$nulls":3},"",""]
["Auswählen",{"$nulls":6},"Auswählen",{"$nulls":3},"",""]
["Standort der Klasse",{"$nulls":6},"Auswählen",{"$nulls":3},"",""]
["Auswählen",{"$nulls":6},"Auswählen",{"$nulls":3},"",""]
[{"$nulls":7},"Auswählen",{"$nulls":3},"",""]
[{"$nulls":7},"Auswählen",{"$nulls":3},"",""]
[{"$nulls":7},"Auswählen",{"$nulls":3},"",""]
[{"$nulls":7},"Auswählen",{"$nulls":3},"",""]
[{"$nulls":7},"Auswählen",{"$nulls":3},"",""]
[{"$nulls":7},"Auswählen",{"$nulls":3},"",""]
[{"$nulls":7},"Auswählen",{"$nulls":3},"",""]
[{"$nulls":7},"Auswählen",{"$nulls":3},"",""]
[null,null,"Total",null,null,{"$f":"SUM(F151:F165)","v":{"v":0,"d":"0.0"}}]
[]
[{"$f":"+A!A64","v":{"v":0,"d":"0.0"}},{"$f":"+A!I64","v":0},"Klassenlehrer/in",{"$nulls":4},"Auswählen",{"$nulls":3},{"$f":"IF(H168=\"nicht statistikpflichtig\",\"nicht statistikpflichtig\",IF(H168=\"Auswählen\",\"\",A$172))","v":""},{"$f":"IF(H168=\"nicht statistikpflichtig\",\"nicht statistikpflichtig\",IF(H168=\"Auswählen\",\"\",A$174))","v":""}]
[{"$f":"+A!A65","v":{"v":0,"d":"0.0"}},{"$nulls":6},"Auswählen",{"$nulls":3},{"$f":"IF(H169=\"nicht statistikpflichtig\",\"nicht statistikpflichtig\",IF(H169=\"Auswählen\",\"\",A$172))","v":""},{"$f":"IF(H169=\"nicht statistikpflichtig\",\"nicht statistikpflichtig\",IF(H169=\"Auswählen\",\"\",A$174))","v":""}]
[{"$f":"+A!A66","v":{"v":0,"d":"0.0"}},{"$nulls":6},"Auswählen",{"$nulls":3},"",""]
["Unterrichtsstufe der Klasse",{"$nulls":6},"Auswählen",{"$nulls":3},"",""]
["Auswählen",{"$nulls":6},"Auswählen",{"$nulls":3},"",""]
["Standort der Klasse",{"$nulls":6},"Auswählen",{"$nulls":3},"",""]
["Auswählen",{"$nulls":6},"Auswählen",{"$nulls":3},"",""]
[{"$nulls":7},"Auswählen",{"$nulls":3},"",""]
[{"$nulls":7},"Auswählen",{"$nulls":3},"",""]
[{"$nulls":7},"Auswählen",{"$nulls":3},"",""]
[{"$nulls":7},"Auswählen",{"$nulls":3},"",""]
[{"$nulls":7},"Auswählen",{"$nulls":3},"",""]
[{"$nulls":7},"Auswählen",{"$nulls":3},"",""]
[{"$nulls":7},"Auswählen",{"$nulls":3},"",""]
[{"$nulls":7},"Auswählen",{"$nulls":3},"",""]
[null,null,"Total",null,null,{"$f":"SUM(F168:F182)","v":{"v":0,"d":"0.0"}}]
[]
[{"$f":"+A!A68","v":{"v":0,"d":"0.0"}},{"$f":"+A!I68","v":0},"Klassenlehrer/in",{"$nulls":4},"Auswählen",{"$nulls":3},{"$f":"IF(H185=\"nicht statistikpflichtig\",\"nicht statistikpflichtig\",IF(H185=\"Auswählen\",\"\",A$189))","v":""},{"$f":"IF(H185=\"nicht statistikpflichtig\",\"nicht statistikpflichtig\",IF(H185=\"Auswählen\",\"\",A$191))","v":""}]
[{"$f":"+A!A69","v":{"v":0,"d":"0.0"}},{"$nulls":6},"Auswählen",{"$nulls":3},{"$f":"IF(H186=\"nicht statistikpflichtig\",\"nicht statistikpflichtig\",IF(H186=\"Auswählen\",\"\",A$189))","v":""},{"$f":"IF(H186=\"nicht statistikpflichtig\",\"nicht statistikpflichtig\",IF(H186=\"Auswählen\",\"\",A$191))","v":""}]
[{"$f":"+A!A70","v":{"v":0,"d":"0.0"}},{"$nulls":6},"Auswählen",{"$nulls":3},"",""]
["Unterrichtsstufe der Klasse",{"$nulls":6},"Auswählen",{"$nulls":3},"",""]
["Auswählen",{"$nulls":6},"Auswählen",{"$nulls":3},"",""]
["Standort der Klasse",{"$nulls":6},"Auswählen",{"$nulls":3},"",""]
["Auswählen",{"$nulls":6},"Auswählen",{"$nulls":3},"",""]
[{"$nulls":7},"Auswählen",{"$nulls":3},"",""]
[{"$nulls":7},"Auswählen",{"$nulls":3},"",""]
[{"$nulls":7},"Auswählen",{"$nulls":3},"",""]
[{"$nulls":7},"Auswählen",{"$nulls":3},"",""]
[{"$nulls":7},"Auswählen",{"$nulls":3},"",""]
[{"$nulls":7},"Auswählen",{"$nulls":3},"",""]
[{"$nulls":7},"Auswählen",{"$nulls":3},"",""]
[{"$nulls":7},"Auswählen",{"$nulls":3},"",""]
[null,null,"Total",null,null,{"$f":"SUM(F185:F199)","v":{"v":0,"d":"0.0"}}]
[]
[{"$f":"+A!A72","v":{"v":0,"d":"0.0"}},{"$f":"+A!I72","v":0},"Klassenlehrer/in",{"$nulls":4},"Auswählen",{"$nulls":3},{"$f":"IF(H202=\"nicht statistikpflichtig\",\"nicht statistikpflichtig\",IF(H202=\"Auswählen\",\"\",A$206))","v":""},{"$f":"IF(H202=\"nicht statistikpflichtig\",\"nicht statistikpflichtig\",IF(H202=\"Auswählen\",\"\",A$208))","v":""}]
[{"$f":"+A!A73","v":{"v":0,"d":"0.0"}},{"$nulls":6},"Auswählen",{"$nulls":3},{"$f":"IF(H203=\"nicht statistikpflichtig\",\"nicht statistikpflichtig\",IF(H203=\"Auswählen\",\"\",A$206))","v":""},{"$f":"IF(H203=\"nicht statistikpflichtig\",\"nicht statistikpflichtig\",IF(H203=\"Auswählen\",\"\",A$208))","v":""}]
[{"$f":"+A!A74","v":{"v":0,"d":"0.0"}},{"$nulls":6},"Auswählen",{"$nulls":3},"",""]
["Unterrichtsstufe der Klasse",{"$nulls":6},"Auswählen",{"$nulls":3},"",""]
["Auswählen",{"$nulls":6},"Auswählen",{"$nulls":3},"",""]
["Standort der Klasse",{"$nulls":6},"Auswählen",{"$nulls":3},"",""]
["Auswählen",{"$nulls":6},"Auswählen",{"$nulls":3},"",""]
[{"$nulls":7},"Auswählen",{"$nulls":3},"",""]
[{"$nulls":7},"Auswählen",{"$nulls":3},"",""]
[{"$nulls":7},"Auswählen",{"$nulls":3},"",""]
[{"$nulls":7},"Auswählen",{"$nulls":3},"",""]
[{"$nulls":7},"Auswählen",{"$nulls":3},"",""]
[{"$nulls":7},"Auswählen",{"$nulls":3},"",""]
[{"$nulls":7},"Auswählen",{"$nulls":3},"",""]
[{"$nulls":7},"Auswählen",{"$nulls":3},"",""]
[null,null,"Total",null,null,{"$f":"SUM(F202:F216)","v":{"v":0,"d":"0.0"}}]
[]
[{"$f":"+A!A76","v":{"v":0,"d":"0.0"}},{"$f":"+A!I76","v":0},"Klassenlehrer/in",{"$nulls":4},"Auswählen",{"$nulls":3},{"$f":"IF(H219=\"nicht statistikpflichtig\",\"nicht statistikpflichtig\",IF(H219=\"Auswählen\",\"\",A$223))","v":""},{"$f":"IF(H219=\"nicht statistikpflichtig\",\"nicht statistikpflichtig\",IF(H219=\"Auswählen\",\"\",A$225))","v":""}]
[{"$f":"+A!A77","v":{"v":0,"d":"0.0"}},{"$nulls":6},"Auswählen",{"$nulls":3},{"$f":"IF(H220=\"nicht statistikpflichtig\",\"nicht statistikpflichtig\",IF(H220=\"Auswählen\",\"\",A$223))","v":""},{"$f":"IF(H220=\"nicht statistikpflichtig\",\"nicht statistikpflichtig\",IF(H220=\"Auswählen\",\"\",A$225))","v":""}]
[{"$f":"+A!A78","v":{"v":0,"d":"0.0"}},{"$nulls":6},"Auswählen",{"$nulls":3},"",""]
["Unterrichtsstufe der Klasse",{"$nulls":6},"Auswählen",{"$nulls":3},"",""]
["Auswählen",{"$nulls":6},"Auswählen",{"$nulls":3},"",""]
["Standort der Klasse",{"$nulls":6},"Auswählen",{"$nulls":3},"",""]
["Auswählen",{"$nulls":6},"Auswählen",{"$nulls":3},"",""]
[{"$nulls":7},"Auswählen",{"$nulls":3},"",""]
[{"$nulls":7},"Auswählen",{"$nulls":3},"",""]
[{"$nulls":7},"Auswählen",{"$nulls":3},"",""]
[{"$nulls":7},"Auswählen",{"$nulls":3},"",""]
[{"$nulls":7},"Auswählen",{"$nulls":3},"",""]
[{"$nulls":7},"Auswählen",{"$nulls":3},"",""]
[{"$nulls":7},"Auswählen",{"$nulls":3},"",""]
[{"$nulls":7},"Auswählen",{"$nulls":3},"",""]
[null,null,"Total",null,null,{"$f":"SUM(F219:F233)","v":{"v":0,"d":"0.0"}}]
[]
[{"$f":"+A!A80","v":{"v":0,"d":"0.0"}},{"$f":"+A!I80","v":0},"Klassenlehrer/in",{"$nulls":4},"Auswählen",{"$nulls":3},{"$f":"IF(H236=\"nicht statistikpflichtig\",\"nicht statistikpflichtig\",IF(H236=\"Auswählen\",\"\",A$240))","v":""},{"$f":"IF(H236=\"nicht statistikpflichtig\",\"nicht statistikpflichtig\",IF(H236=\"Auswählen\",\"\",A$242))","v":""}]
[{"$f":"+A!A81","v":{"v":0,"d":"0.0"}},{"$nulls":6},"Auswählen",{"$nulls":3},{"$f":"IF(H237=\"nicht statistikpflichtig\",\"nicht statistikpflichtig\",IF(H237=\"Auswählen\",\"\",A$240))","v":""},{"$f":"IF(H237=\"nicht statistikpflichtig\",\"nicht statistikpflichtig\",IF(H237=\"Auswählen\",\"\",A$242))","v":""}]
[{"$f":"+A!A82","v":{"v":0,"d":"0.0"}},{"$nulls":6},"Auswählen",{"$nulls":3},"",""]
["Unterrichtsstufe der Klasse",{"$nulls":6},"Auswählen",{"$nulls":3},"",""]
["Auswählen",{"$nulls":6},"Auswählen",{"$nulls":3},"",""]
["Standort der Klasse",{"$nulls":6},"Auswählen",{"$nulls":3},"",""]
["Auswählen",{"$nulls":6},"Auswählen",{"$nulls":3},"",""]
[{"$nulls":7},"Auswählen",{"$nulls":3},"",""]
[{"$nulls":7},"Auswählen",{"$nulls":3},"",""]
[{"$nulls":7},"Auswählen",{"$nulls":3},"",""]
[{"$nulls":7},"Auswählen",{"$nulls":3},"",""]
[{"$nulls":7},"Auswählen",{"$nulls":3},"",""]
[{"$nulls":7},"Auswählen",{"$nulls":3},"",""]
[{"$nulls":7},"Auswählen",{"$nulls":3},"",""]
[{"$nulls":7},"Auswählen",{"$nulls":3},"",""]
[null,null,"Total",null,null,{"$f":"SUM(F236:F250)","v":{"v":0,"d":"0.0"}}]
[]
[{"$f":"+A!A84","v":{"v":0,"d":"0.0"}},{"$f":"+A!I84","v":0},"Klassenlehrer/in",{"$nulls":4},"Auswählen",{"$nulls":3},{"$f":"IF(H253=\"nicht statistikpflichtig\",\"nicht statistikpflichtig\",IF(H253=\"Auswählen\",\"\",A$257))","v":""},{"$f":"IF(H253=\"nicht statistikpflichtig\",\"nicht statistikpflichtig\",IF(H253=\"Auswählen\",\"\",A$259))","v":""}]
[{"$f":"+A!A85","v":{"v":0,"d":"0.0"}},{"$nulls":6},"Auswählen",{"$nulls":3},{"$f":"IF(H254=\"nicht statistikpflichtig\",\"nicht statistikpflichtig\",IF(H254=\"Auswählen\",\"\",A$257))","v":""},{"$f":"IF(H254=\"nicht statistikpflichtig\",\"nicht statistikpflichtig\",IF(H254=\"Auswählen\",\"\",A$259))","v":""}]
[{"$f":"+A!A86","v":{"v":0,"d":"0.0"}},{"$nulls":6},"Auswählen",{"$nulls":3},"",""]
["Unterrichtsstufe der Klasse",{"$nulls":6},"Auswählen",{"$nulls":3},"",""]
["Auswählen",{"$nulls":6},"Auswählen",{"$nulls":3},"",""]
["Standort der Klasse",{"$nulls":6},"Auswählen",{"$nulls":3},"",""]
["Auswählen",{"$nulls":6},"Auswählen",{"$nulls":3},"",""]
[{"$nulls":7},"Auswählen",{"$nulls":3},"",""]
[{"$nulls":7},"Auswählen",{"$nulls":3},"",""]
[{"$nulls":7},"Auswählen",{"$nulls":3},"",""]
[{"$nulls":7},"Auswählen",{"$nulls":3},"",""]
[{"$nulls":7},"Auswählen",{"$nulls":3},"",""]
[{"$nulls":7},"Auswählen",{"$nulls":3},"",""]
[{"$nulls":7},"Auswählen",{"$nulls":3},"",""]
[{"$nulls":7},"Auswählen",{"$nulls":3},"",""]
[null,null,"Total",null,null,{"$f":"SUM(F253:F267)","v":{"v":0,"d":"0.0"}}]
[]
[{"$f":"+A!A88","v":{"v":0,"d":"0.0"}},{"$f":"+A!I88","v":0},"Klassenlehrer/in",{"$nulls":4},"Auswählen",{"$nulls":3},{"$f":"IF(H270=\"nicht statistikpflichtig\",\"nicht statistikpflichtig\",IF(H270=\"Auswählen\",\"\",A$274))","v":""},{"$f":"IF(H270=\"nicht statistikpflichtig\",\"nicht statistikpflichtig\",IF(H270=\"Auswählen\",\"\",A$276))","v":""}]
[{"$f":"+A!A89","v":{"v":0,"d":"0.0"}},{"$nulls":6},"Auswählen",{"$nulls":3},{"$f":"IF(H271=\"nicht statistikpflichtig\",\"nicht statistikpflichtig\",IF(H271=\"Auswählen\",\"\",A$274))","v":""},{"$f":"IF(H271=\"nicht statistikpflichtig\",\"nicht statistikpflichtig\",IF(H271=\"Auswählen\",\"\",A$276))","v":""}]
[{"$f":"+A!A90","v":{"v":0,"d":"0.0"}},{"$nulls":6},"Auswählen",{"$nulls":3},"",""]
["Unterrichtsstufe der Klasse",{"$nulls":6},"Auswählen",{"$nulls":3},"",""]
["Auswählen",{"$nulls":6},"Auswählen",{"$nulls":3},"",""]
["Standort der Klasse",{"$nulls":6},"Auswählen",{"$nulls":3},"",""]
["Auswählen",{"$nulls":6},"Auswählen",{"$nulls":3},"",""]
[{"$nulls":7},"Auswählen",{"$nulls":3},"",""]
[{"$nulls":7},"Auswählen",{"$nulls":3},"",""]
[{"$nulls":7},"Auswählen",{"$nulls":3},"",""]
[{"$nulls":7},"Auswählen",{"$nulls":3},"",""]
[{"$nulls":7},"Auswählen",{"$nulls":3},"",""]
[{"$nulls":7},"Auswählen",{"$nulls":3},"",""]
[{"$nulls":7},"Auswählen",{"$nulls":3},"",""]
[{"$nulls":7},"Auswählen",{"$nulls":3},"",""]
[null,null,"Total",null,null,{"$f":"SUM(F270:F284)","v":{"v":0,"d":"0.0"}}]
[]
[{"$f":"+A!A92","v":{"v":0,"d":"0.0"}},{"$f":"+A!I92","v":0},"Klassenlehrer/in",{"$nulls":4},"Auswählen",{"$nulls":3},{"$f":"IF(H287=\"nicht statistikpflichtig\",\"nicht statistikpflichtig\",IF(H287=\"Auswählen\",\"\",A$291))","v":""},{"$f":"IF(H287=\"nicht statistikpflichtig\",\"nicht statistikpflichtig\",IF(H287=\"Auswählen\",\"\",A$293))","v":""}]
[{"$f":"+A!A93","v":{"v":0,"d":"0.0"}},{"$nulls":6},"Auswählen",{"$nulls":3},{"$f":"IF(H288=\"nicht statistikpflichtig\",\"nicht statistikpflichtig\",IF(H288=\"Auswählen\",\"\",A$291))","v":""},{"$f":"IF(H288=\"nicht statistikpflichtig\",\"nicht statistikpflichtig\",IF(H288=\"Auswählen\",\"\",A$293))","v":""}]
[{"$f":"+A!A94","v":{"v":0,"d":"0.0"}},{"$nulls":6},"Auswählen",{"$nulls":3},"",""]
["Unterrichtsstufe der Klasse",{"$nulls":6},"Auswählen",{"$nulls":3},"",""]
["Auswählen",{"$nulls":6},"Auswählen",{"$nulls":3},"",""]
["Standort der Klasse",{"$nulls":6},"Auswählen",{"$nulls":3},"",{"$f":"IF(H292=\"nicht statistikpflichtig\",\"nicht statistikpflichtig\",IF(H292=\"Auswählen\",\"\",A$293))","v":""}]
["Auswählen",{"$nulls":6},"Auswählen",{"$nulls":3},"",""]
[{"$nulls":7},"Auswählen",{"$nulls":3},"",""]
[{"$nulls":7},"Auswählen",{"$nulls":3},"",""]
[{"$nulls":7},"Auswählen",{"$nulls":3},"",""]
[{"$nulls":7},"Auswählen",{"$nulls":3},"",""]
[{"$nulls":7},"Auswählen",{"$nulls":3},"",""]
[{"$nulls":7},"Auswählen",{"$nulls":3},"",""]
[{"$nulls":7},"Auswählen",{"$nulls":3},"",""]
[{"$nulls":7},"Auswählen",{"$nulls":3},"",""]
[null,null,"Total",null,null,{"$f":"SUM(F287:F301)","v":{"v":0,"d":"0.0"}}]
[]
[{"$f":"+A!A96","v":{"v":0,"d":"0.0"}},{"$f":"+A!I96","v":0},"Klassenlehrer/in",{"$nulls":4},"Auswählen",{"$nulls":3},{"$f":"IF(H304=\"nicht statistikpflichtig\",\"nicht statistikpflichtig\",IF(H304=\"Auswählen\",\"\",A$308))","v":""},{"$f":"IF(H304=\"nicht statistikpflichtig\",\"nicht statistikpflichtig\",IF(H304=\"Auswählen\",\"\",A$310))","v":""}]
[{"$f":"+A!A97","v":{"v":0,"d":"0.0"}},{"$nulls":6},"Auswählen",{"$nulls":3},{"$f":"IF(H305=\"nicht statistikpflichtig\",\"nicht statistikpflichtig\",IF(H305=\"Auswählen\",\"\",A$308))","v":""},{"$f":"IF(H305=\"nicht statistikpflichtig\",\"nicht statistikpflichtig\",IF(H305=\"Auswählen\",\"\",A$310))","v":""}]
[{"$f":"+A!A98","v":{"v":0,"d":"0.0"}},{"$nulls":6},"Auswählen",{"$nulls":3},"",""]
["Unterrichtsstufe der Klasse",{"$nulls":6},"Auswählen",{"$nulls":3},"",""]
["Auswählen",{"$nulls":6},"Auswählen",{"$nulls":3},"",""]
["Standort der Klasse",{"$nulls":6},"Auswählen",{"$nulls":3},"",""]
["Auswählen",{"$nulls":6},"Auswählen",{"$nulls":3},"",""]
[{"$nulls":7},"Auswählen",{"$nulls":3},"",""]
[{"$nulls":7},"Auswählen",{"$nulls":3},"",""]
[{"$nulls":7},"Auswählen",{"$nulls":3},"",""]
[{"$nulls":7},"Auswählen",{"$nulls":3},"",""]
[{"$nulls":7},"Auswählen",{"$nulls":3},"",""]
[{"$nulls":7},"Auswählen",{"$nulls":3},"",""]
[{"$nulls":7},"Auswählen",{"$nulls":3},"",""]
[{"$nulls":7},"Auswählen",{"$nulls":3},"",""]
[null,null,"Total",null,null,{"$f":"SUM(F304:F318)","v":{"v":0,"d":"0.0"}}]
[]
[{"$f":"+A!A100","v":{"v":0,"d":"0.0"}},{"$f":"+A!I100","v":0},"Klassenlehrer/in",{"$nulls":4},"Auswählen",{"$nulls":3},{"$f":"IF(H321=\"nicht statistikpflichtig\",\"nicht statistikpflichtig\",IF(H321=\"Auswählen\",\"\",A$325))","v":""},{"$f":"IF(H321=\"nicht statistikpflichtig\",\"nicht statistikpflichtig\",IF(H321=\"Auswählen\",\"\",A$327))","v":""}]
[{"$f":"+A!A101","v":{"v":0,"d":"0.0"}},{"$nulls":6},"Auswählen",{"$nulls":3},{"$f":"IF(H322=\"nicht statistikpflichtig\",\"nicht statistikpflichtig\",IF(H322=\"Auswählen\",\"\",A$325))","v":""},{"$f":"IF(H322=\"nicht statistikpflichtig\",\"nicht statistikpflichtig\",IF(H322=\"Auswählen\",\"\",A$327))","v":""}]
[{"$f":"+A!A102","v":{"v":0,"d":"0.0"}},{"$nulls":6},"Auswählen",{"$nulls":3},"",""]
["Unterrichtsstufe der Klasse",{"$nulls":6},"Auswählen",{"$nulls":3},"",""]
["Auswählen",{"$nulls":6},"Auswählen",{"$nulls":3},"",""]
["Standort der Klasse",{"$nulls":6},"Auswählen",{"$nulls":3},"",""]
["Auswählen",{"$nulls":6},"Auswählen",{"$nulls":3},"",""]
[{"$nulls":7},"Auswählen",{"$nulls":3},"",""]
[{"$nulls":7},"Auswählen",{"$nulls":3},"",""]
[{"$nulls":7},"Auswählen",{"$nulls":3},"",""]
[{"$nulls":7},"Auswählen",{"$nulls":3},"",""]
[{"$nulls":7},"Auswählen",{"$nulls":3},"",""]
[{"$nulls":7},"Auswählen",{"$nulls":3},"",""]
[{"$nulls":7},"Auswählen",{"$nulls":3},"",""]
[{"$nulls":7},"Auswählen",{"$nulls":3},"",""]
[null,null,"Total",null,null,{"$f":"SUM(F321:F335)","v":{"v":0,"d":"0.0"}}]
[]
[{"$f":"+A!A104","v":{"v":0,"d":"0.0"}},{"$f":"+A!I104","v":0},"Klassenlehrer/in",{"$nulls":4},"Auswählen",{"$nulls":3},{"$f":"IF(H338=\"nicht statistikpflichtig\",\"nicht statistikpflichtig\",IF(H338=\"Auswählen\",\"\",A$342))","v":""},{"$f":"IF(H338=\"nicht statistikpflichtig\",\"nicht statistikpflichtig\",IF(H338=\"Auswählen\",\"\",A$344))","v":""}]
[{"$f":"+A!A105","v":{"v":0,"d":"0.0"}},{"$nulls":6},"Auswählen",{"$nulls":3},{"$f":"IF(H339=\"nicht statistikpflichtig\",\"nicht statistikpflichtig\",IF(H339=\"Auswählen\",\"\",A$342))","v":""},{"$f":"IF(H339=\"nicht statistikpflichtig\",\"nicht statistikpflichtig\",IF(H339=\"Auswählen\",\"\",A$344))","v":""}]
[{"$f":"+A!A106","v":{"v":0,"d":"0.0"}},{"$nulls":6},"Auswählen",{"$nulls":3},"",""]
["Unterrichtsstufe der Klasse",{"$nulls":6},"Auswählen",{"$nulls":3},"",""]
["Auswählen",{"$nulls":6},"Auswählen",{"$nulls":3},"",""]
["Standort der Klasse",{"$nulls":6},"Auswählen",{"$nulls":3},"",""]
["Auswählen",{"$nulls":6},"Auswählen",{"$nulls":3},"",""]
[{"$nulls":7},"Auswählen",{"$nulls":3},"",""]
[{"$nulls":7},"Auswählen",{"$nulls":3},"",""]
[{"$nulls":7},"Auswählen",{"$nulls":3},"",""]
[{"$nulls":7},"Auswählen",{"$nulls":3},"",""]
[{"$nulls":7},"Auswählen",{"$nulls":3},"",""]
[{"$nulls":7},"Auswählen",{"$nulls":3},"",""]
[{"$nulls":7},"Auswählen",{"$nulls":3},"",""]
[{"$nulls":7},"Auswählen",{"$nulls":3},"",""]
[null,null,"Total",null,null,{"$f":"SUM(F338:F352)","v":{"v":0,"d":"0.0"}}]
[]
[{"$f":"+A!A108","v":{"v":0,"d":"0.0"}},{"$f":"+A!I108","v":0},"Klassenlehrer/in",{"$nulls":4},"Auswählen",{"$nulls":3},{"$f":"IF(H355=\"nicht statistikpflichtig\",\"nicht statistikpflichtig\",IF(H355=\"Auswählen\",\"\",A$359))","v":""},{"$f":"IF(H355=\"nicht statistikpflichtig\",\"nicht statistikpflichtig\",IF(H355=\"Auswählen\",\"\",A$361))","v":""}]
[{"$f":"+A!A109","v":{"v":0,"d":"0.0"}},{"$nulls":6},"Auswählen",{"$nulls":3},{"$f":"IF(H356=\"nicht statistikpflichtig\",\"nicht statistikpflichtig\",IF(H356=\"Auswählen\",\"\",A$359))","v":""},{"$f":"IF(H356=\"nicht statistikpflichtig\",\"nicht statistikpflichtig\",IF(H356=\"Auswählen\",\"\",A$361))","v":""}]
[{"$f":"+A!A110","v":{"v":0,"d":"0.0"}},{"$nulls":6},"Auswählen",{"$nulls":3},"",""]
["Unterrichtsstufe der Klasse",{"$nulls":6},"Auswählen",{"$nulls":3},"",""]
["Auswählen",{"$nulls":6},"Auswählen",{"$nulls":3},"",""]
["Standort der Klasse",{"$nulls":6},"Auswählen",{"$nulls":3},"",""]
["Auswählen",{"$nulls":6},"Auswählen",{"$nulls":3},"",""]
[{"$nulls":7},"Auswählen",{"$nulls":3},"",""]
[{"$nulls":7},"Auswählen",{"$nulls":3},"",""]
[{"$nulls":7},"Auswählen",{"$nulls":3},"",""]
[{"$nulls":7},"Auswählen",{"$nulls":3},"",""]
[{"$nulls":7},"Auswählen",{"$nulls":3},"",""]
[{"$nulls":7},"Auswählen",{"$nulls":3},"",""]
[{"$nulls":7},"Auswählen",{"$nulls":3},"",""]
[{"$nulls":7},"Auswählen",{"$nulls":3},"",""]
[null,null,"Total",null,null,{"$f":"SUM(F355:F369)","v":{"v":0,"d":"0.0"}}]
[]
[{"$f":"+A!A112","v":{"v":0,"d":"0.0"}},{"$f":"+A!I112","v":0},"Klassenlehrer/in",{"$nulls":4},"Auswählen",{"$nulls":3},{"$f":"IF(H372=\"nicht statistikpflichtig\",\"nicht statistikpflichtig\",IF(H372=\"Auswählen\",\"\",A$376))","v":""},{"$f":"IF(H372=\"nicht statistikpflichtig\",\"nicht statistikpflichtig\",IF(H372=\"Auswählen\",\"\",A$378))","v":""}]
[{"$f":"+A!A113","v":{"v":0,"d":"0.0"}},{"$nulls":6},"Auswählen",{"$nulls":3},{"$f":"IF(H373=\"nicht statistikpflichtig\",\"nicht statistikpflichtig\",IF(H373=\"Auswählen\",\"\",A$376))","v":""},{"$f":"IF(H373=\"nicht statistikpflichtig\",\"nicht statistikpflichtig\",IF(H373=\"Auswählen\",\"\",A$378))","v":""}]
[{"$f":"+A!A114","v":{"v":0,"d":"0.0"}},{"$nulls":6},"Auswählen",{"$nulls":3},"",""]
["Unterrichtsstufe der Klasse",{"$nulls":6},"Auswählen",{"$nulls":3},"",""]
["Auswählen",{"$nulls":6},"Auswählen",{"$nulls":3},"",""]
["Standort der Klasse",{"$nulls":6},"Auswählen",{"$nulls":3},"",""]
["Auswählen",{"$nulls":6},"Auswählen",{"$nulls":3},"",""]
[{"$nulls":7},"Auswählen",{"$nulls":3},"",""]
[{"$nulls":7},"Auswählen",{"$nulls":3},"",""]
[{"$nulls":7},"Auswählen",{"$nulls":3},"",""]
[{"$nulls":7},"Auswählen",{"$nulls":3},"",""]
[{"$nulls":7},"Auswählen",{"$nulls":3},"",""]
[{"$nulls":7},"Auswählen",{"$nulls":3},"",""]
[{"$nulls":7},"Auswählen",{"$nulls":3},"",""]
[{"$nulls":7},"Auswählen",{"$nulls":3},"",""]
[null,null,"Total",null,null,{"$f":"SUM(F372:F386)","v":{"v":0,"d":"0.0"}}]
[]
[{"$f":"+A!A116","v":{"v":0,"d":"0.0"}},{"$f":"+A!I116","v":0},"Klassenlehrer/in",{"$nulls":4},"Auswählen",{"$nulls":3},{"$f":"IF(H389=\"nicht statistikpflichtig\",\"nicht statistikpflichtig\",IF(H389=\"Auswählen\",\"\",A$393))","v":""},{"$f":"IF(H389=\"nicht statistikpflichtig\",\"nicht statistikpflichtig\",IF(H389=\"Auswählen\",\"\",A$395))","v":""}]
[{"$f":"+A!A117","v":{"v":0,"d":"0.0"}},{"$nulls":6},"Auswählen",{"$nulls":3},{"$f":"IF(H390=\"nicht statistikpflichtig\",\"nicht statistikpflichtig\",IF(H390=\"Auswählen\",\"\",A$393))","v":""},{"$f":"IF(H390=\"nicht statistikpflichtig\",\"nicht statistikpflichtig\",IF(H390=\"Auswählen\",\"\",A$395))","v":""}]
[{"$f":"+A!A118","v":{"v":0,"d":"0.0"}},{"$nulls":6},"Auswählen",{"$nulls":3},"",""]
["Unterrichtsstufe der Klasse",{"$nulls":6},"Auswählen",{"$nulls":3},"",""]
["Auswählen",{"$nulls":6},"Auswählen",{"$nulls":3},"",""]
["Standort der Klasse",{"$nulls":6},"Auswählen",{"$nulls":3},"",""]
["Auswählen",{"$nulls":6},"Auswählen",{"$nulls":3},"",""]
[{"$nulls":7},"Auswählen",{"$nulls":3},"",""]
[{"$nulls":7},"Auswählen",{"$nulls":3},"",""]
[{"$nulls":7},"Auswählen",{"$nulls":3},"",""]
[{"$nulls":7},"Auswählen",{"$nulls":3},"",""]
[{"$nulls":7},"Auswählen",{"$nulls":3},"",""]
[{"$nulls":7},"Auswählen",{"$nulls":3},"",""]
[{"$nulls":7},"Auswählen",{"$nulls":3},"",""]
[{"$nulls":7},"Auswählen",{"$nulls":3},"",""]
[null,null,"Total",null,null,{"$f":"SUM(F389:F403)","v":{"v":0,"d":"0.0"}}]
[]
[{"$f":"+A!A120","v":{"v":0,"d":"0.0"}},{"$f":"+A!I120","v":0},"Klassenlehrer/in",{"$nulls":4},"Auswählen",{"$nulls":3},{"$f":"IF(H406=\"nicht statistikpflichtig\",\"nicht statistikpflichtig\",IF(H406=\"Auswählen\",\"\",A$410))","v":""},{"$f":"IF(H406=\"nicht statistikpflichtig\",\"nicht statistikpflichtig\",IF(H406=\"Auswählen\",\"\",A$412))","v":""}]
[{"$f":"+A!A121","v":{"v":0,"d":"0.0"}},{"$nulls":6},"Auswählen",{"$nulls":3},{"$f":"IF(H407=\"nicht statistikpflichtig\",\"nicht statistikpflichtig\",IF(H407=\"Auswählen\",\"\",A$410))","v":""},{"$f":"IF(H407=\"nicht statistikpflichtig\",\"nicht statistikpflichtig\",IF(H407=\"Auswählen\",\"\",A$412))","v":""}]
[{"$f":"+A!A122","v":{"v":0,"d":"0.0"}},{"$nulls":6},"Auswählen",{"$nulls":3},"",""]
["Unterrichtsstufe der Klasse",{"$nulls":6},"Auswählen",{"$nulls":3},"",""]
["Auswählen",{"$nulls":6},"Auswählen",{"$nulls":3},"",""]
["Standort der Klasse",{"$nulls":6},"Auswählen",{"$nulls":3},"",""]
["Auswählen",{"$nulls":6},"Auswählen",{"$nulls":3},"",""]
[{"$nulls":7},"Auswählen",{"$nulls":3},"",""]
[{"$nulls":7},"Auswählen",{"$nulls":3},"",""]
[{"$nulls":7},"Auswählen",{"$nulls":3},"",""]
[{"$nulls":7},"Auswählen",{"$nulls":3},"",""]
[{"$nulls":7},"Auswählen",{"$nulls":3},"",""]
[{"$nulls":7},"Auswählen",{"$nulls":3},"",""]
[{"$nulls":7},"Auswählen",{"$nulls":3},"",""]
[{"$nulls":7},"Auswählen",{"$nulls":3},"",""]
[null,null,"Total",null,null,{"$f":"SUM(F406:F420)","v":{"v":0,"d":"0.0"}}]
[]
[{"$f":"+A!A124","v":{"v":0,"d":"0.0"}},{"$f":"+A!I124","v":0},"Klassenlehrer/in",{"$nulls":4},"Auswählen",{"$nulls":3},{"$f":"IF(H423=\"nicht statistikpflichtig\",\"nicht statistikpflichtig\",IF(H423=\"Auswählen\",\"\",A$427))","v":""},{"$f":"IF(H423=\"nicht statistikpflichtig\",\"nicht statistikpflichtig\",IF(H423=\"Auswählen\",\"\",A$429))","v":""}]
[{"$f":"+A!A125","v":{"v":0,"d":"0.0"}},{"$nulls":6},"Auswählen",{"$nulls":3},{"$f":"IF(H424=\"nicht statistikpflichtig\",\"nicht statistikpflichtig\",IF(H424=\"Auswählen\",\"\",A$427))","v":""},{"$f":"IF(H424=\"nicht statistikpflichtig\",\"nicht statistikpflichtig\",IF(H424=\"Auswählen\",\"\",A$429))","v":""}]
[{"$f":"+A!A126","v":{"v":0,"d":"0.0"}},{"$nulls":6},"Auswählen",{"$nulls":3},"",""]
["Unterrichtsstufe der Klasse",{"$nulls":6},"Auswählen",{"$nulls":3},"",""]
["Auswählen",{"$nulls":6},"Auswählen",{"$nulls":3},"",""]
["Standort der Klasse",{"$nulls":6},"Auswählen",{"$nulls":3},"",""]
["Auswählen",{"$nulls":6},"Auswählen",{"$nulls":3},"",""]
[{"$nulls":7},"Auswählen",{"$nulls":3},"",""]
[{"$nulls":7},"Auswählen",{"$nulls":3},"",""]
[{"$nulls":7},"Auswählen",{"$nulls":3},"",""]
[{"$nulls":7},"Auswählen",{"$nulls":3},"",""]
[{"$nulls":7},"Auswählen",{"$nulls":3},"",""]
[{"$nulls":7},"Auswählen",{"$nulls":3},"",""]
[{"$nulls":7},"Auswählen",{"$nulls":3},"",""]
[{"$nulls":7},"Auswählen",{"$nulls":3},"",""]
[null,null,"Total",null,null,{"$f":"SUM(F423:F437)","v":{"v":0,"d":"0.0"}}]
[]
[{"$f":"+A!A128","v":{"v":0,"d":"0.0"}},{"$f":"+A!I128","v":0},"Klassenlehrer/in",{"$nulls":4},"Auswählen",{"$nulls":3},{"$f":"IF(H440=\"nicht statistikpflichtig\",\"nicht statistikpflichtig\",IF(H440=\"Auswählen\",\"\",A$444))","v":""},{"$f":"IF(H440=\"nicht statistikpflichtig\",\"nicht statistikpflichtig\",IF(H440=\"Auswählen\",\"\",A$446))","v":""}]
[{"$f":"+A!A129","v":{"v":0,"d":"0.0"}},{"$nulls":6},"Auswählen",{"$nulls":3},{"$f":"IF(H441=\"nicht statistikpflichtig\",\"nicht statistikpflichtig\",IF(H441=\"Auswählen\",\"\",A$444))","v":""},{"$f":"IF(H441=\"nicht statistikpflichtig\",\"nicht statistikpflichtig\",IF(H441=\"Auswählen\",\"\",A$446))","v":""}]
[{"$f":"+A!A130","v":{"v":0,"d":"0.0"}},{"$nulls":6},"Auswählen",{"$nulls":3},"",""]
["Unterrichtsstufe der Klasse",{"$nulls":6},"Auswählen",{"$nulls":3},"",""]
["Auswählen",{"$nulls":6},"Auswählen",{"$nulls":3},"",""]
["Standort der Klasse",{"$nulls":6},"Auswählen",{"$nulls":3},"",""]
["Auswählen",{"$nulls":6},"Auswählen",{"$nulls":3},"",""]
[{"$nulls":7},"Auswählen",{"$nulls":3},"",""]
[{"$nulls":7},"Auswählen",{"$nulls":3},"",""]
[{"$nulls":7},"Auswählen",{"$nulls":3},"",""]
[{"$nulls":7},"Auswählen",{"$nulls":3},"",""]
[{"$nulls":7},"Auswählen",{"$nulls":3},"",""]
[{"$nulls":7},"Auswählen",{"$nulls":3},"",""]
[{"$nulls":7},"Auswählen",{"$nulls":3},"",""]
[{"$nulls":7},"Auswählen",{"$nulls":3},"",""]
[null,null,"Total",null,null,{"$f":"SUM(F440:F454)","v":{"v":0,"d":"0.0"}}]
[]
[{"$f":"+A!A132","v":{"v":0,"d":"0.0"}},{"$f":"+A!I132","v":0},"Klassenlehrer/in",{"$nulls":4},"Auswählen",{"$nulls":3},{"$f":"IF(H457=\"nicht statistikpflichtig\",\"nicht statistikpflichtig\",IF(H457=\"Auswählen\",\"\",A$461))","v":""},{"$f":"IF(H457=\"nicht statistikpflichtig\",\"nicht statistikpflichtig\",IF(H457=\"Auswählen\",\"\",A$463))","v":""}]
[{"$f":"+A!A133","v":{"v":0,"d":"0.0"}},{"$nulls":6},"Auswählen",{"$nulls":3},{"$f":"IF(H458=\"nicht statistikpflichtig\",\"nicht statistikpflichtig\",IF(H458=\"Auswählen\",\"\",A$461))","v":""},{"$f":"IF(H458=\"nicht statistikpflichtig\",\"nicht statistikpflichtig\",IF(H458=\"Auswählen\",\"\",A$463))","v":""}]
[{"$f":"+A!A134","v":{"v":0,"d":"0.0"}},{"$nulls":6},"Auswählen",{"$nulls":3},"",""]
["Unterrichtsstufe der Klasse",{"$nulls":6},"Auswählen",{"$nulls":3},"",""]
["Auswählen",{"$nulls":6},"Auswählen",{"$nulls":3},"",""]
["Standort der Klasse",{"$nulls":6},"Auswählen",{"$nulls":3},"",""]
["Auswählen",{"$nulls":6},"Auswählen",{"$nulls":3},"",""]
[{"$nulls":7},"Auswählen",{"$nulls":3},"",""]
[{"$nulls":7},"Auswählen",{"$nulls":3},"",""]
[{"$nulls":7},"Auswählen",{"$nulls":3},"",""]
[{"$nulls":7},"Auswählen",{"$nulls":3},"",""]
[{"$nulls":7},"Auswählen",{"$nulls":3},"",""]
[{"$nulls":7},"Auswählen",{"$nulls":3},"",""]
[{"$nulls":7},"Auswählen",{"$nulls":3},"",""]
[{"$nulls":7},"Auswählen",{"$nulls":3},"",""]
[null,null,"Total",null,null,{"$f":"SUM(F457:F471)","v":{"v":0,"d":"0.0"}}]
[]
[{"$f":"+A!A136","v":{"v":0,"d":"0.0"}},{"$f":"+A!I136","v":0},"Klassenlehrer/in",{"$nulls":4},"Auswählen",{"$nulls":3},{"$f":"IF(H474=\"nicht statistikpflichtig\",\"nicht statistikpflichtig\",IF(H474=\"Auswählen\",\"\",A$478))","v":""},{"$f":"IF(H474=\"nicht statistikpflichtig\",\"nicht statistikpflichtig\",IF(H474=\"Auswählen\",\"\",A$480))","v":""}]
[{"$f":"+A!A137","v":{"v":0,"d":"0.0"}},{"$nulls":6},"Auswählen",{"$nulls":3},{"$f":"IF(H475=\"nicht statistikpflichtig\",\"nicht statistikpflichtig\",IF(H475=\"Auswählen\",\"\",A$478))","v":""},{"$f":"IF(H475=\"nicht statistikpflichtig\",\"nicht statistikpflichtig\",IF(H475=\"Auswählen\",\"\",A$480))","v":""}]
[{"$f":"+A!A138","v":{"v":0,"d":"0.0"}},{"$nulls":6},"Auswählen",{"$nulls":3},"",""]
["Unterrichtsstufe der Klasse",{"$nulls":6},"Auswählen",{"$nulls":3},"",""]
["Auswählen",{"$nulls":6},"Auswählen",{"$nulls":3},"",""]
["Standort der Klasse",{"$nulls":6},"Auswählen",{"$nulls":3},"",""]
["Auswählen",{"$nulls":6},"Auswählen",{"$nulls":3},"",""]
[{"$nulls":7},"Auswählen",{"$nulls":3},"",""]
[{"$nulls":7},"Auswählen",{"$nulls":3},"",""]
[{"$nulls":7},"Auswählen",{"$nulls":3},"",""]
[{"$nulls":7},"Auswählen",{"$nulls":3},"",""]
[{"$nulls":7},"Auswählen",{"$nulls":3},"",""]
[{"$nulls":7},"Auswählen",{"$nulls":3},"",""]
[{"$nulls":7},"Auswählen",{"$nulls":3},"",""]
[{"$nulls":7},"Auswählen",{"$nulls":3},"",""]
[null,null,"Total",null,null,{"$f":"SUM(F474:F488)","v":{"v":0,"d":"0.0"}}]
[]
[{"$f":"+A!A140","v":{"v":0,"d":"0.0"}},{"$f":"+A!I140","v":0},"Klassenlehrer/in",{"$nulls":4},"Auswählen",{"$nulls":3},{"$f":"IF(H491=\"nicht statistikpflichtig\",\"nicht statistikpflichtig\",IF(H491=\"Auswählen\",\"\",A$495))","v":""},{"$f":"IF(H491=\"nicht statistikpflichtig\",\"nicht statistikpflichtig\",IF(H491=\"Auswählen\",\"\",A$497))","v":""}]
[{"$f":"+A!A141","v":{"v":0,"d":"0.0"}},{"$nulls":6},"Auswählen",{"$nulls":3},{"$f":"IF(H492=\"nicht statistikpflichtig\",\"nicht statistikpflichtig\",IF(H492=\"Auswählen\",\"\",A$495))","v":""},{"$f":"IF(H492=\"nicht statistikpflichtig\",\"nicht statistikpflichtig\",IF(H492=\"Auswählen\",\"\",A$497))","v":""}]
[{"$f":"+A!A142","v":{"v":0,"d":"0.0"}},{"$nulls":6},"Auswählen",{"$nulls":3},"",""]
["Unterrichtsstufe der Klasse",{"$nulls":6},"Auswählen",{"$nulls":3},"",""]
["Auswählen",{"$nulls":6},"Auswählen",{"$nulls":3},"",""]
["Standort der Klasse",{"$nulls":6},"Auswählen",{"$nulls":3},"",""]
["Auswählen",{"$nulls":6},"Auswählen",{"$nulls":3},"",""]
[{"$nulls":7},"Auswählen",{"$nulls":3},"",""]
[{"$nulls":7},"Auswählen",{"$nulls":3},"",""]
[{"$nulls":7},"Auswählen",{"$nulls":3},"",""]
[{"$nulls":7},"Auswählen",{"$nulls":3},"",""]
[{"$nulls":7},"Auswählen",{"$nulls":3},"",""]
[{"$nulls":7},"Auswählen",{"$nulls":3},"",""]
[{"$nulls":7},"Auswählen",{"$nulls":3},"",""]
[{"$nulls":7},"Auswählen",{"$nulls":3},"",""]
[null,null,"Total",null,null,{"$f":"SUM(F491:F505)","v":{"v":0,"d":"0.0"}}]
[]
[{"$f":"+A!A144","v":{"v":0,"d":"0.0"}},{"$f":"+A!I144","v":0},"Klassenlehrer/in",{"$nulls":4},"Auswählen",{"$nulls":3},{"$f":"IF(H508=\"nicht statistikpflichtig\",\"nicht statistikpflichtig\",IF(H508=\"Auswählen\",\"\",A$512))","v":""},{"$f":"IF(H508=\"nicht statistikpflichtig\",\"nicht statistikpflichtig\",IF(H508=\"Auswählen\",\"\",A$514))","v":""}]
[{"$f":"+A!A145","v":{"v":0,"d":"0.0"}},{"$nulls":6},"Auswählen",{"$nulls":3},{"$f":"IF(H509=\"nicht statistikpflichtig\",\"nicht statistikpflichtig\",IF(H509=\"Auswählen\",\"\",A$512))","v":""},{"$f":"IF(H509=\"nicht statistikpflichtig\",\"nicht statistikpflichtig\",IF(H509=\"Auswählen\",\"\",A$514))","v":""}]
[{"$f":"+A!A146","v":{"v":0,"d":"0.0"}},{"$nulls":6},"Auswählen",{"$nulls":3},"",""]
["Unterrichtsstufe der Klasse",{"$nulls":6},"Auswählen",{"$nulls":3},"",""]
["Auswählen",{"$nulls":6},"Auswählen",{"$nulls":3},"",""]
["Standort der Klasse",{"$nulls":6},"Auswählen",{"$nulls":3},"",""]
["Auswählen",{"$nulls":6},"Auswählen",{"$nulls":3},"",""]
[{"$nulls":7},"Auswählen",{"$nulls":3},"",""]
[{"$nulls":7},"Auswählen",{"$nulls":3},"",""]
[{"$nulls":7},"Auswählen",{"$nulls":3},"",""]
[{"$nulls":7},"Auswählen",{"$nulls":3},"",""]
[{"$nulls":7},"Auswählen",{"$nulls":3},"",""]
[{"$nulls":7},"Auswählen",{"$nulls":3},"",""]
[{"$nulls":7},"Auswählen",{"$nulls":3},"",""]
[{"$nulls":7},"Auswählen",{"$nulls":3},"",""]
[null,null,"Total",null,null,{"$f":"SUM(F508:F522)","v":{"v":0,"d":"0.0"}}]
[]
[{"$f":"+A!A148","v":{"v":0,"d":"0.0"}},{"$f":"+A!I148","v":0},"Klassenlehrer/in",{"$nulls":4},"Auswählen",{"$nulls":3},{"$f":"IF(H525=\"nicht statistikpflichtig\",\"nicht statistikpflichtig\",IF(H525=\"Auswählen\",\"\",A$529))","v":""},{"$f":"IF(H525=\"nicht statistikpflichtig\",\"nicht statistikpflichtig\",IF(H525=\"Auswählen\",\"\",A$531))","v":""}]
[{"$f":"+A!A149","v":{"v":0,"d":"0.0"}},{"$f":"+A!I148","v":0},{"$nulls":5},"Auswählen",{"$nulls":3},{"$f":"IF(H526=\"nicht statistikpflichtig\",\"nicht statistikpflichtig\",IF(H526=\"Auswählen\",\"\",A$529))","v":""},{"$f":"IF(H526=\"nicht statistikpflichtig\",\"nicht statistikpflichtig\",IF(H526=\"Auswählen\",\"\",A$531))","v":""}]
[{"$f":"+A!A150","v":{"v":0,"d":"0.0"}},{"$nulls":6},"Auswählen",{"$nulls":3},"",""]
["Unterrichtsstufe der Klasse",{"$nulls":6},"Auswählen",{"$nulls":3},"",""]
["Auswählen",{"$nulls":6},"Auswählen",{"$nulls":3},"",""]
["Standort der Klasse",{"$nulls":6},"Auswählen",{"$nulls":3},"",""]
["Auswählen",{"$nulls":6},"Auswählen",{"$nulls":3},"",""]
[{"$nulls":7},"Auswählen",{"$nulls":3},"",""]
[{"$nulls":7},"Auswählen",{"$nulls":3},"",""]
[{"$nulls":7},"Auswählen",{"$nulls":3},"",""]
[{"$nulls":7},"Auswählen",{"$nulls":3},"",""]
[{"$nulls":7},"Auswählen",{"$nulls":3},"",""]
[{"$nulls":7},"Auswählen",{"$nulls":3},"",""]
[{"$nulls":7},"Auswählen",{"$nulls":3},"",""]
[{"$nulls":7},"Auswählen",{"$nulls":3},"",""]
[null,null,"Total",null,null,{"$f":"SUM(F525:F539)","v":{"v":0,"d":"0.0"}}]
[]
[{"$f":"+A!A152","v":{"v":0,"d":"0.0"}},{"$f":"+A!I152","v":0},"Klassenlehrer/in",{"$nulls":4},"Auswählen",{"$nulls":3},{"$f":"IF(H542=\"nicht statistikpflichtig\",\"nicht statistikpflichtig\",IF(H542=\"Auswählen\",\"\",A$546))","v":""},{"$f":"IF(H542=\"nicht statistikpflichtig\",\"nicht statistikpflichtig\",IF(H542=\"Auswählen\",\"\",A$548))","v":""}]
[{"$f":"+A!A153","v":{"v":0,"d":"0.0"}},{"$f":"+A!I152","v":0},{"$nulls":5},"Auswählen",{"$nulls":3},{"$f":"IF(H543=\"nicht statistikpflichtig\",\"nicht statistikpflichtig\",IF(H543=\"Auswählen\",\"\",A$546))","v":""},{"$f":"IF(H543=\"nicht statistikpflichtig\",\"nicht statistikpflichtig\",IF(H543=\"Auswählen\",\"\",A$548))","v":""}]
[{"$f":"+A!A154","v":{"v":0,"d":"0.0"}},{"$nulls":6},"Auswählen",{"$nulls":3},"",""]
["Unterrichtsstufe der Klasse",{"$nulls":6},"Auswählen",{"$nulls":3},"",""]
["Auswählen",{"$nulls":6},"Auswählen",{"$nulls":3},"",""]
["Standort der Klasse",{"$nulls":6},"Auswählen",{"$nulls":3},"",""]
["Auswählen",{"$nulls":6},"Auswählen",{"$nulls":3},"",""]
[{"$nulls":7},"Auswählen",{"$nulls":3},"",""]
[{"$nulls":7},"Auswählen",{"$nulls":3},"",""]
[{"$nulls":7},"Auswählen",{"$nulls":3},"",""]
[{"$nulls":7},"Auswählen",{"$nulls":3},"",""]
[{"$nulls":7},"Auswählen",{"$nulls":3},"",""]
[{"$nulls":7},"Auswählen",{"$nulls":3},"",""]
[{"$nulls":7},"Auswählen",{"$nulls":3},"",""]
[{"$nulls":7},"Auswählen",{"$nulls":3},"",""]
[null,null,"Total",null,null,{"$f":"SUM(F542:F556)","v":{"v":0,"d":"0.0"}}]
[]
[{"$f":"+A!A156","v":{"v":0,"d":"0.0"}},{"$f":"+A!I156","v":0},"Klassenlehrer/in",{"$nulls":4},"Auswählen",{"$nulls":3},{"$f":"IF(H559=\"nicht statistikpflichtig\",\"nicht statistikpflichtig\",IF(H559=\"Auswählen\",\"\",A$563))","v":""},{"$f":"IF(H559=\"nicht statistikpflichtig\",\"nicht statistikpflichtig\",IF(H559=\"Auswählen\",\"\",A$565))","v":""}]
[{"$f":"+A!A157","v":{"v":0,"d":"0.0"}},{"$f":"+A!I156","v":0},{"$nulls":5},"Auswählen",{"$nulls":3},{"$f":"IF(H560=\"nicht statistikpflichtig\",\"nicht statistikpflichtig\",IF(H560=\"Auswählen\",\"\",A$563))","v":""},{"$f":"IF(H560=\"nicht statistikpflichtig\",\"nicht statistikpflichtig\",IF(H560=\"Auswählen\",\"\",A$565))","v":""}]
[{"$f":"+A!A158","v":{"v":0,"d":"0.0"}},{"$nulls":6},"Auswählen",{"$nulls":3},"",""]
["Unterrichtsstufe der Klasse",{"$nulls":6},"Auswählen",{"$nulls":3},"",""]
["Auswählen",{"$nulls":6},"Auswählen",{"$nulls":3},"",""]
["Standort der Klasse",{"$nulls":6},"Auswählen",{"$nulls":3},"",""]
["Auswählen",{"$nulls":6},"Auswählen",{"$nulls":3},"",""]
[{"$nulls":7},"Auswählen",{"$nulls":3},"",""]
[{"$nulls":7},"Auswählen",{"$nulls":3},"",""]
[{"$nulls":7},"Auswählen",{"$nulls":3},"",""]
[{"$nulls":7},"Auswählen",{"$nulls":3},"",""]
[{"$nulls":7},"Auswählen",{"$nulls":3},"",""]
[{"$nulls":7},"Auswählen",{"$nulls":3},"",""]
[{"$nulls":7},"Auswählen",{"$nulls":3},"",""]
[{"$nulls":7},"Auswählen",{"$nulls":3},"",""]
[null,null,"Total",null,null,{"$f":"SUM(F559:F573)","v":{"v":0,"d":"0.0"}}]
[]
[{"$f":"+A!A160","v":{"v":0,"d":"0.0"}},{"$f":"+A!I160","v":0},"Klassenlehrer/in",{"$nulls":4},"Auswählen",{"$nulls":3},{"$f":"IF(H576=\"nicht statistikpflichtig\",\"nicht statistikpflichtig\",IF(H576=\"Auswählen\",\"\",A$580))","v":""},{"$f":"IF(H576=\"nicht statistikpflichtig\",\"nicht statistikpflichtig\",IF(H576=\"Auswählen\",\"\",A$582))","v":""}]
[{"$f":"+A!A161","v":{"v":0,"d":"0.0"}},{"$f":"+A!I160","v":0},{"$nulls":5},"Auswählen",{"$nulls":3},{"$f":"IF(H577=\"nicht statistikpflichtig\",\"nicht statistikpflichtig\",IF(H577=\"Auswählen\",\"\",A$580))","v":""},{"$f":"IF(H577=\"nicht statistikpflichtig\",\"nicht statistikpflichtig\",IF(H577=\"Auswählen\",\"\",A$582))","v":""}]
[{"$f":"+A!A162","v":{"v":0,"d":"0.0"}},{"$nulls":6},"Auswählen",{"$nulls":3},"",""]
["Unterrichtsstufe der Klasse",{"$nulls":6},"Auswählen",{"$nulls":3},"",""]
["Auswählen",{"$nulls":6},"Auswählen",{"$nulls":3},"",""]
["Standort der Klasse",{"$nulls":6},"Auswählen",{"$nulls":3},"",""]
["Auswählen",{"$nulls":6},"Auswählen",{"$nulls":3},"",""]
[{"$nulls":7},"Auswählen",{"$nulls":3},"",""]
[{"$nulls":7},"Auswählen",{"$nulls":3},"",""]
[{"$nulls":7},"Auswählen",{"$nulls":3},"",""]
[{"$nulls":7},"Auswählen",{"$nulls":3},"",""]
[{"$nulls":7},"Auswählen",{"$nulls":3},"",""]
[{"$nulls":7},"Auswählen",{"$nulls":3},"",""]
[{"$nulls":7},"Auswählen",{"$nulls":3},"",""]
[{"$nulls":7},"Auswählen",{"$nulls":3},"",""]
[null,null,"Total",null,null,{"$f":"SUM(F576:F590)","v":{"v":0,"d":"0.0"}}]
[]
[{"$f":"+A!A164","v":{"v":0,"d":"0.0"}},{"$f":"+A!I164","v":0},"Klassenlehrer/in",{"$nulls":4},"Auswählen",{"$nulls":3},{"$f":"IF(H593=\"nicht statistikpflichtig\",\"nicht statistikpflichtig\",IF(H593=\"Auswählen\",\"\",A$597))","v":""},{"$f":"IF(H593=\"nicht statistikpflichtig\",\"nicht statistikpflichtig\",IF(H593=\"Auswählen\",\"\",A$599))","v":""}]
[{"$f":"+A!A165","v":{"v":0,"d":"0.0"}},{"$f":"+A!I164","v":0},{"$nulls":5},"Auswählen",{"$nulls":3},{"$f":"IF(H594=\"nicht statistikpflichtig\",\"nicht statistikpflichtig\",IF(H594=\"Auswählen\",\"\",A$597))","v":""},{"$f":"IF(H594=\"nicht statistikpflichtig\",\"nicht statistikpflichtig\",IF(H594=\"Auswählen\",\"\",A$599))","v":""}]
[{"$f":"+A!A166","v":{"v":0,"d":"0.0"}},{"$nulls":6},"Auswählen",{"$nulls":3},"",""]
["Unterrichtsstufe der Klasse",{"$nulls":6},"Auswählen",{"$nulls":3},"",""]
["Auswählen",{"$nulls":6},"Auswählen",{"$nulls":3},"",""]
["Standort der Klasse",{"$nulls":6},"Auswählen",{"$nulls":3},"",""]
["Auswählen",{"$nulls":6},"Auswählen",{"$nulls":3},"",""]
[{"$nulls":7},"Auswählen",{"$nulls":3},"",""]
[{"$nulls":7},"Auswählen",{"$nulls":3},"",""]
[{"$nulls":7},"Auswählen",{"$nulls":3},"",""]
[{"$nulls":7},"Auswählen",{"$nulls":3},"",""]
[{"$nulls":7},"Auswählen",{"$nulls":3},"",""]
[{"$nulls":7},"Auswählen",{"$nulls":3},"",""]
[{"$nulls":7},"Auswählen",{"$nulls":3},"",""]
[{"$nulls":7},"Auswählen",{"$nulls":3},"",""]
[null,null,"Total",null,null,{"$f":"SUM(F593:F607)","v":{"v":0,"d":"0.0"}}]
[]
[{"$f":"+A!A168","v":{"v":0,"d":"0.0"}},{"$f":"+A!I168","v":0},"Klassenlehrer/in",{"$nulls":4},"Auswählen",{"$nulls":3},{"$f":"IF(H610=\"nicht statistikpflichtig\",\"nicht statistikpflichtig\",IF(H610=\"Auswählen\",\"\",A$614))","v":""},{"$f":"IF(H610=\"nicht statistikpflichtig\",\"nicht statistikpflichtig\",IF(H610=\"Auswählen\",\"\",A$616))","v":""}]
[{"$f":"+A!A169","v":{"v":0,"d":"0.0"}},{"$f":"+A!I168","v":0},{"$nulls":5},"Auswählen",{"$nulls":3},{"$f":"IF(H611=\"nicht statistikpflichtig\",\"nicht statistikpflichtig\",IF(H611=\"Auswählen\",\"\",A$614))","v":""},{"$f":"IF(H611=\"nicht statistikpflichtig\",\"nicht statistikpflichtig\",IF(H611=\"Auswählen\",\"\",A$616))","v":""}]
[{"$f":"+A!A170","v":{"v":0,"d":"0.0"}},{"$nulls":6},"Auswählen",{"$nulls":3},"",""]
["Unterrichtsstufe der Klasse",{"$nulls":6},"Auswählen",{"$nulls":3},"",""]
["Auswählen",{"$nulls":6},"Auswählen",{"$nulls":3},"",""]
["Standort der Klasse",{"$nulls":6},"Auswählen",{"$nulls":3},"",""]
["Auswählen",{"$nulls":6},"Auswählen",{"$nulls":3},"",""]
[{"$nulls":7},"Auswählen",{"$nulls":3},"",""]
[{"$nulls":7},"Auswählen",{"$nulls":3},"",""]
[{"$nulls":7},"Auswählen",{"$nulls":3},"",""]
[{"$nulls":7},"Auswählen",{"$nulls":3},"",""]
[{"$nulls":7},"Auswählen",{"$nulls":3},"",""]
[{"$nulls":7},"Auswählen",{"$nulls":3},"",""]
[{"$nulls":7},"Auswählen",{"$nulls":3},"",""]
[{"$nulls":7},"Auswählen",{"$nulls":3},"",""]
[null,null,"Total",null,null,{"$f":"SUM(F610:F624)","v":{"v":0,"d":"0.0"}}]
[]
[{"$f":"+A!A172","v":{"v":0,"d":"0.0"}},{"$f":"+A!I172","v":0},"Klassenlehrer/in",{"$nulls":4},"Auswählen",{"$nulls":3},{"$f":"IF(H627=\"nicht statistikpflichtig\",\"nicht statistikpflichtig\",IF(H627=\"Auswählen\",\"\",A$631))","v":""},{"$f":"IF(H627=\"nicht statistikpflichtig\",\"nicht statistikpflichtig\",IF(H627=\"Auswählen\",\"\",A$633))","v":""}]
[{"$f":"+A!A173","v":{"v":0,"d":"0.0"}},{"$f":"+A!I172","v":0},{"$nulls":5},"Auswählen",{"$nulls":3},{"$f":"IF(H628=\"nicht statistikpflichtig\",\"nicht statistikpflichtig\",IF(H628=\"Auswählen\",\"\",A$631))","v":""},{"$f":"IF(H628=\"nicht statistikpflichtig\",\"nicht statistikpflichtig\",IF(H628=\"Auswählen\",\"\",A$633))","v":""}]
[{"$f":"+A!A174","v":{"v":0,"d":"0.0"}},{"$nulls":6},"Auswählen",{"$nulls":3},"",""]
["Unterrichtsstufe der Klasse",{"$nulls":6},"Auswählen",{"$nulls":3},"",""]
["Auswählen",{"$nulls":6},"Auswählen",{"$nulls":3},"",""]
["Standort der Klasse",{"$nulls":6},"Auswählen",{"$nulls":3},"",""]
["Auswählen",{"$nulls":6},"Auswählen",{"$nulls":3},"",""]
[{"$nulls":7},"Auswählen",{"$nulls":3},"",""]
[{"$nulls":7},"Auswählen",{"$nulls":3},"",""]
[{"$nulls":7},"Auswählen",{"$nulls":3},"",""]
[{"$nulls":7},"Auswählen",{"$nulls":3},"",""]
[{"$nulls":7},"Auswählen",{"$nulls":3},"",""]
[{"$nulls":7},"Auswählen",{"$nulls":3},"",""]
[{"$nulls":7},"Auswählen",{"$nulls":3},"",""]
[{"$nulls":7},"Auswählen",{"$nulls":3},"",""]
[null,null,"Total",null,null,{"$f":"SUM(F627:F641)","v":{"v":0,"d":"0.0"}}]
[]
[{"$f":"+A!A176","v":{"v":0,"d":"0.0"}},{"$f":"+A!I176","v":0},"Klassenlehrer/in",{"$nulls":4},"Auswählen",{"$nulls":3},{"$f":"IF(H644=\"nicht statistikpflichtig\",\"nicht statistikpflichtig\",IF(H644=\"Auswählen\",\"\",A$648))","v":""},{"$f":"IF(H644=\"nicht statistikpflichtig\",\"nicht statistikpflichtig\",IF(H644=\"Auswählen\",\"\",A$650))","v":""}]
[{"$f":"+A!A177","v":{"v":0,"d":"0.0"}},{"$f":"+A!I176","v":0},{"$nulls":5},"Auswählen",{"$nulls":3},{"$f":"IF(H645=\"nicht statistikpflichtig\",\"nicht statistikpflichtig\",IF(H645=\"Auswählen\",\"\",A$648))","v":""},{"$f":"IF(H645=\"nicht statistikpflichtig\",\"nicht statistikpflichtig\",IF(H645=\"Auswählen\",\"\",A$650))","v":""}]
[{"$f":"+A!A178","v":{"v":0,"d":"0.0"}},{"$nulls":6},"Auswählen",{"$nulls":3},"",""]
["Unterrichtsstufe der Klasse",{"$nulls":6},"Auswählen",{"$nulls":3},"",""]
["Auswählen",{"$nulls":6},"Auswählen",{"$nulls":3},"",""]
["Standort der Klasse",{"$nulls":6},"Auswählen",{"$nulls":3},"",""]
["Auswählen",{"$nulls":6},"Auswählen",{"$nulls":3},"",""]
[{"$nulls":7},"Auswählen",{"$nulls":3},"",""]
[{"$nulls":7},"Auswählen",{"$nulls":3},"",""]
[{"$nulls":7},"Auswählen",{"$nulls":3},"",""]
[{"$nulls":7},"Auswählen",{"$nulls":3},"",""]
[{"$nulls":7},"Auswählen",{"$nulls":3},"",""]
[{"$nulls":7},"Auswählen",{"$nulls":3},"",""]
[{"$nulls":7},"Auswählen",{"$nulls":3},"",""]
[{"$nulls":7},"Auswählen",{"$nulls":3},"",""]
[null,null,"Total",null,null,{"$f":"SUM(F644:F658)","v":{"v":0,"d":"0.0"}}]
[]
[{"$f":"+A!A180","v":{"v":0,"d":"0.0"}},{"$f":"+A!I180","v":0},"Klassenlehrer/in",{"$nulls":4},"Auswählen",{"$nulls":3},{"$f":"IF(H661=\"nicht statistikpflichtig\",\"nicht statistikpflichtig\",IF(H661=\"Auswählen\",\"\",A$665))","v":""},{"$f":"IF(H661=\"nicht statistikpflichtig\",\"nicht statistikpflichtig\",IF(H661=\"Auswählen\",\"\",A$667))","v":""}]
[{"$f":"+A!A181","v":{"v":0,"d":"0.0"}},{"$f":"+A!I180","v":0},{"$nulls":5},"Auswählen",{"$nulls":3},{"$f":"IF(H662=\"nicht statistikpflichtig\",\"nicht statistikpflichtig\",IF(H662=\"Auswählen\",\"\",A$665))","v":""},{"$f":"IF(H662=\"nicht statistikpflichtig\",\"nicht statistikpflichtig\",IF(H662=\"Auswählen\",\"\",A$667))","v":""}]
[{"$f":"+A!A182","v":{"v":0,"d":"0.0"}},{"$nulls":6},"Auswählen",{"$nulls":3},"",""]
["Unterrichtsstufe der Klasse",{"$nulls":6},"Auswählen",{"$nulls":3},"",""]
["Auswählen",{"$nulls":6},"Auswählen",{"$nulls":3},"",""]
["Standort der Klasse",{"$nulls":6},"Auswählen",{"$nulls":3},"",""]
["Auswählen",{"$nulls":6},"Auswählen",{"$nulls":3},"",""]
[{"$nulls":7},"Auswählen",{"$nulls":3},"",""]
[{"$nulls":7},"Auswählen",{"$nulls":3},"",""]
[{"$nulls":7},"Auswählen",{"$nulls":3},"",""]
[{"$nulls":7},"Auswählen",{"$nulls":3},"",""]
[{"$nulls":7},"Auswählen",{"$nulls":3},"",""]
[{"$nulls":7},"Auswählen",{"$nulls":3},"",""]
[{"$nulls":7},"Auswählen",{"$nulls":3},"",""]
[{"$nulls":7},"Auswählen",{"$nulls":3},"",""]
[null,null,"Total",null,null,{"$f":"SUM(F661:F675)","v":{"v":0,"d":"0.0"}}]
[]
[{"$f":"+A!A184","v":{"v":0,"d":"0.0"}},{"$f":"+A!I184","v":0},"Klassenlehrer/in",{"$nulls":4},"Auswählen",{"$nulls":3},{"$f":"IF(H678=\"nicht statistikpflichtig\",\"nicht statistikpflichtig\",IF(H678=\"Auswählen\",\"\",A$682))","v":""},{"$f":"IF(H678=\"nicht statistikpflichtig\",\"nicht statistikpflichtig\",IF(H678=\"Auswählen\",\"\",A$684))","v":""}]
[{"$f":"+A!A185","v":{"v":0,"d":"0.0"}},{"$f":"+A!I184","v":0},{"$nulls":5},"Auswählen",{"$nulls":3},{"$f":"IF(H679=\"nicht statistikpflichtig\",\"nicht statistikpflichtig\",IF(H679=\"Auswählen\",\"\",A$682))","v":""},{"$f":"IF(H679=\"nicht statistikpflichtig\",\"nicht statistikpflichtig\",IF(H679=\"Auswählen\",\"\",A$684))","v":""}]
[{"$f":"+A!A186","v":{"v":0,"d":"0.0"}},{"$nulls":6},"Auswählen",{"$nulls":3},"",""]
["Unterrichtsstufe der Klasse",{"$nulls":6},"Auswählen",{"$nulls":3},"",""]
["Auswählen",{"$nulls":6},"Auswählen",{"$nulls":3},"",""]
["Standort der Klasse",{"$nulls":6},"Auswählen",{"$nulls":3},"",""]
["Auswählen",{"$nulls":6},"Auswählen",{"$nulls":3},"",""]
[{"$nulls":7},"Auswählen",{"$nulls":3},"",""]
[{"$nulls":7},"Auswählen",{"$nulls":3},"",""]
[{"$nulls":7},"Auswählen",{"$nulls":3},"",""]
[{"$nulls":7},"Auswählen",{"$nulls":3},"",""]
[{"$nulls":7},"Auswählen",{"$nulls":3},"",""]
[{"$nulls":7},"Auswählen",{"$nulls":3},"",""]
[{"$nulls":7},"Auswählen",{"$nulls":3},"",""]
[{"$nulls":7},"Auswählen",{"$nulls":3},"",""]
[null,null,"Total",null,null,{"$f":"SUM(F678:F692)","v":{"v":0,"d":"0.0"}}]

{"sheet":"E","index":5,"n_rows":166,"n_cols":14,"rows_kept":166,"merged":[[11,0,13,0],[11,1,13,1],[11,2,13,2],[11,3,13,3],[11,4,13,4],[11,5,13,5],[11,6,13,6],[11,7,13,7],[11,8,13,8],[11,9,13,9],[11,10,13,10],[11,12,13,12],[11,13,13,13]]}
["Kalenderjahr",{"$f":"+Zusammenzug!B4","v":2024},{"$f":"+Zusammenzug!B6","v":0}]
["Teil E: Pensum des weiteren angestellten Personals (Grundlage für die Statistik des Schulpersonals des Bundes)"]
["Weiteres statistikpflichtiges Schulpersonal (Schulleitung, extern tätige Personen B&U, Logopädie, Psychomotorik)"]
[]
["Hinweise zum Ausfüllen",null,"Kontakt für Fragen zur Bundesstatistik: Nicole Wellinger, Fachstelle für Statstik Kanton St.Gallen, nicole.wellinger@sg.ch, 058 229 01 77"]
["Eingabefelder für freien Text sind gelb hinterlegt"]
["Auswahlfelder sind dunkelgelb hinterlegt. Felder, die zwingend ausgefüllt werden müssen, sind mit dem Standardwert \"Auswählen\" gekennzeichnet. Sie werden hellgelb, wenn ein Wert erfasst wurde."]
["Grüne Felder erfassen Informationen für die Statistik des Schulpersonal des Bundes."]
["Bitte beachten Sie die Hinweise in den Kommentaren der Spaltentitel"]
[]
[]
["Funktion gemäss Anstellung","Art des Arbeitsvertrags","Jahre im Schul- dienst","Nachname","Vorname","AHV-Nummer","Geschlecht F/M","Geburts- datum","Nationalität","Diplome","Lektionen/\nStunden",null,"Standort","Bemerkungen für Statistik"]
[{"$nulls":11},"Unterrichtsstufe"]
[]
[]
[]
["Auswählen","Auswählen",{"$nulls":4},"Auswählen",null,"Auswählen","Auswählen",null,"Auswählen","Auswählen"]
["Auswählen","Auswählen",{"$nulls":4},"Auswählen",null,"Auswählen","Auswählen",null,"Auswählen","Auswählen"]
["Auswählen","Auswählen",{"$nulls":4},"Auswählen",null,"Auswählen","Auswählen",null,"Auswählen","Auswählen"]
["Auswählen","Auswählen",{"$nulls":4},"Auswählen",null,"Auswählen","Auswählen",null,"Auswählen","Auswählen"]
["Auswählen","Auswählen",{"$nulls":4},"Auswählen",null,"Auswählen","Auswählen",null,"Auswählen","Auswählen"]
["Auswählen","Auswählen",{"$nulls":4},"Auswählen",null,"Auswählen","Auswählen",null,"Auswählen","Auswählen"]
["Auswählen","Auswählen",{"$nulls":4},"Auswählen",null,"Auswählen","Auswählen",null,"Auswählen","Auswählen"]
["Auswählen","Auswählen",{"$nulls":4},"Auswählen",null,"Auswählen","Auswählen",null,"Auswählen","Auswählen"]
["Auswählen","Auswählen",{"$nulls":4},"Auswählen",null,"Auswählen","Auswählen",null,"Auswählen","Auswählen"]
["Auswählen","Auswählen",{"$nulls":4},"Auswählen",null,"Auswählen","Auswählen",null,"Auswählen","Auswählen"]
["Auswählen","Auswählen",{"$nulls":4},"Auswählen",null,"Auswählen","Auswählen",null,"Auswählen","Auswählen"]
["Auswählen","Auswählen",{"$nulls":4},"Auswählen",null,"Auswählen","Auswählen",null,"Auswählen","Auswählen"]
["Auswählen","Auswählen",{"$nulls":4},"Auswählen",null,"Auswählen","Auswählen",null,"Auswählen","Auswählen"]
["Auswählen","Auswählen",{"$nulls":4},"Auswählen",null,"Auswählen","Auswählen",null,"Auswählen","Auswählen"]
["Auswählen","Auswählen",{"$nulls":4},"Auswählen",null,"Auswählen","Auswählen",null,"Auswählen","Auswählen"]
["Auswählen","Auswählen",{"$nulls":4},"Auswählen",null,"Auswählen","Auswählen",null,"Auswählen","Auswählen"]
["Auswählen","Auswählen",{"$nulls":4},"Auswählen",null,"Auswählen","Auswählen",null,"Auswählen","Auswählen"]
["Auswählen","Auswählen",{"$nulls":4},"Auswählen",null,"Auswählen","Auswählen",null,"Auswählen","Auswählen"]
["Auswählen","Auswählen",{"$nulls":4},"Auswählen",null,"Auswählen","Auswählen",null,"Auswählen","Auswählen"]
["Auswählen","Auswählen",{"$nulls":4},"Auswählen",null,"Auswählen","Auswählen",null,"Auswählen","Auswählen"]
["Auswählen","Auswählen",{"$nulls":4},"Auswählen",null,"Auswählen","Auswählen",null,"Auswählen","Auswählen"]
["Auswählen","Auswählen",{"$nulls":4},"Auswählen",null,"Auswählen","Auswählen",null,"Auswählen","Auswählen"]
["Auswählen","Auswählen",{"$nulls":4},"Auswählen",null,"Auswählen","Auswählen",null,"Auswählen","Auswählen"]
["Auswählen","Auswählen",{"$nulls":4},"Auswählen",null,"Auswählen","Auswählen",null,"Auswählen","Auswählen"]
["Auswählen","Auswählen",{"$nulls":4},"Auswählen",null,"Auswählen","Auswählen",null,"Auswählen","Auswählen"]
["Auswählen","Auswählen",{"$nulls":4},"Auswählen",null,"Auswählen","Auswählen",null,"Auswählen","Auswählen"]
["Auswählen","Auswählen",{"$nulls":4},"Auswählen",null,"Auswählen","Auswählen",null,"Auswählen","Auswählen"]
["Auswählen","Auswählen",{"$nulls":4},"Auswählen",null,"Auswählen","Auswählen",null,"Auswählen","Auswählen"]
["Auswählen","Auswählen",{"$nulls":4},"Auswählen",null,"Auswählen","Auswählen",null,"Auswählen","Auswählen"]
["Auswählen","Auswählen",{"$nulls":4},"Auswählen",null,"Auswählen","Auswählen",null,"Auswählen","Auswählen"]
["Auswählen","Auswählen",{"$nulls":4},"Auswählen",null,"Auswählen","Auswählen",null,"Auswählen","Auswählen"]
["Auswählen","Auswählen",{"$nulls":4},"Auswählen",null,"Auswählen","Auswählen",null,"Auswählen","Auswählen"]
["Auswählen","Auswählen",{"$nulls":4},"Auswählen",null,"Auswählen","Auswählen",null,"Auswählen","Auswählen"]
["Auswählen","Auswählen",{"$nulls":4},"Auswählen",null,"Auswählen","Auswählen",null,"Auswählen","Auswählen"]
["Auswählen","Auswählen",{"$nulls":4},"Auswählen",null,"Auswählen","Auswählen",null,"Auswählen","Auswählen"]
["Auswählen","Auswählen",{"$nulls":4},"Auswählen",null,"Auswählen","Auswählen",null,"Auswählen","Auswählen"]
["Auswählen","Auswählen",{"$nulls":4},"Auswählen",null,"Auswählen","Auswählen",null,"Auswählen","Auswählen"]
["Auswählen","Auswählen",{"$nulls":4},"Auswählen",null,"Auswählen","Auswählen",null,"Auswählen","Auswählen"]
["Auswählen","Auswählen",{"$nulls":4},"Auswählen",null,"Auswählen","Auswählen",null,"Auswählen","Auswählen"]
["Auswählen","Auswählen",{"$nulls":4},"Auswählen",null,"Auswählen","Auswählen",null,"Auswählen","Auswählen"]
["Auswählen","Auswählen",{"$nulls":4},"Auswählen",null,"Auswählen","Auswählen",null,"Auswählen","Auswählen"]
["Auswählen","Auswählen",{"$nulls":4},"Auswählen",null,"Auswählen","Auswählen",null,"Auswählen","Auswählen"]
["Auswählen","Auswählen",{"$nulls":4},"Auswählen",null,"Auswählen","Auswählen",null,"Auswählen","Auswählen"]
["Auswählen","Auswählen",{"$nulls":4},"Auswählen",null,"Auswählen","Auswählen",null,"Auswählen","Auswählen"]
["Auswählen","Auswählen",{"$nulls":4},"Auswählen",null,"Auswählen","Auswählen",null,"Auswählen","Auswählen"]
["Auswählen","Auswählen",{"$nulls":4},"Auswählen",null,"Auswählen","Auswählen",null,"Auswählen","Auswählen"]
["Auswählen","Auswählen",{"$nulls":4},"Auswählen",null,"Auswählen","Auswählen",null,"Auswählen","Auswählen"]
["Auswählen","Auswählen",{"$nulls":4},"Auswählen",null,"Auswählen","Auswählen",null,"Auswählen","Auswählen"]
["Auswählen","Auswählen",{"$nulls":4},"Auswählen",null,"Auswählen","Auswählen",null,"Auswählen","Auswählen"]
["Auswählen","Auswählen",{"$nulls":4},"Auswählen",null,"Auswählen","Auswählen",null,"Auswählen","Auswählen"]
["Auswählen","Auswählen",{"$nulls":4},"Auswählen",null,"Auswählen","Auswählen",null,"Auswählen","Auswählen"]
["Auswählen","Auswählen",{"$nulls":4},"Auswählen",null,"Auswählen","Auswählen",null,"Auswählen","Auswählen"]
["Auswählen","Auswählen",{"$nulls":4},"Auswählen",null,"Auswählen","Auswählen",null,"Auswählen","Auswählen"]
["Auswählen","Auswählen",{"$nulls":4},"Auswählen",null,"Auswählen","Auswählen",null,"Auswählen","Auswählen"]
["Auswählen","Auswählen",{"$nulls":4},"Auswählen",null,"Auswählen","Auswählen",null,"Auswählen","Auswählen"]
["Auswählen","Auswählen",{"$nulls":4},"Auswählen",null,"Auswählen","Auswählen",null,"Auswählen","Auswählen"]
["Auswählen","Auswählen",{"$nulls":4},"Auswählen",null,"Auswählen","Auswählen",null,"Auswählen","Auswählen"]
["Auswählen","Auswählen",{"$nulls":4},"Auswählen",null,"Auswählen","Auswählen",null,"Auswählen","Auswählen"]
["Auswählen","Auswählen",{"$nulls":4},"Auswählen",null,"Auswählen","Auswählen",null,"Auswählen","Auswählen"]
["Auswählen","Auswählen",{"$nulls":4},"Auswählen",null,"Auswählen","Auswählen",null,"Auswählen","Auswählen"]
["Auswählen","Auswählen",{"$nulls":4},"Auswählen",null,"Auswählen","Auswählen",null,"Auswählen","Auswählen"]
["Auswählen","Auswählen",{"$nulls":4},"Auswählen",null,"Auswählen","Auswählen",null,"Auswählen","Auswählen"]
["Auswählen","Auswählen",{"$nulls":4},"Auswählen",null,"Auswählen","Auswählen",null,"Auswählen","Auswählen"]
["Auswählen","Auswählen",{"$nulls":4},"Auswählen",null,"Auswählen","Auswählen",null,"Auswählen","Auswählen"]
["Auswählen","Auswählen",{"$nulls":4},"Auswählen",null,"Auswählen","Auswählen",null,"Auswählen","Auswählen"]
["Auswählen","Auswählen",{"$nulls":4},"Auswählen",null,"Auswählen","Auswählen",null,"Auswählen","Auswählen"]
["Auswählen","Auswählen",{"$nulls":4},"Auswählen",null,"Auswählen","Auswählen",null,"Auswählen","Auswählen"]
["Auswählen","Auswählen",{"$nulls":4},"Auswählen",null,"Auswählen","Auswählen",null,"Auswählen","Auswählen"]
["Auswählen","Auswählen",{"$nulls":4},"Auswählen",null,"Auswählen","Auswählen",null,"Auswählen","Auswählen"]
["Auswählen","Auswählen",{"$nulls":4},"Auswählen",null,"Auswählen","Auswählen",null,"Auswählen","Auswählen"]
["Auswählen","Auswählen",{"$nulls":4},"Auswählen",null,"Auswählen","Auswählen",null,"Auswählen","Auswählen"]
["Auswählen","Auswählen",{"$nulls":4},"Auswählen",null,"Auswählen","Auswählen",null,"Auswählen","Auswählen"]
["Auswählen","Auswählen",{"$nulls":4},"Auswählen",null,"Auswählen","Auswählen",null,"Auswählen","Auswählen"]
["Auswählen","Auswählen",{"$nulls":4},"Auswählen",null,"Auswählen","Auswählen",null,"Auswählen","Auswählen"]
["Auswählen","Auswählen",{"$nulls":4},"Auswählen",null,"Auswählen","Auswählen",null,"Auswählen","Auswählen"]
["Auswählen","Auswählen",{"$nulls":4},"Auswählen",null,"Auswählen","Auswählen",null,"Auswählen","Auswählen"]
["Auswählen","Auswählen",{"$nulls":4},"Auswählen",null,"Auswählen","Auswählen",null,"Auswählen","Auswählen"]
["Auswählen","Auswählen",{"$nulls":4},"Auswählen",null,"Auswählen","Auswählen",null,"Auswählen","Auswählen"]
["Auswählen","Auswählen",{"$nulls":4},"Auswählen",null,"Auswählen","Auswählen",null,"Auswählen","Auswählen"]
["Auswählen","Auswählen",{"$nulls":4},"Auswählen",null,"Auswählen","Auswählen",null,"Auswählen","Auswählen"]
["Auswählen","Auswählen",{"$nulls":4},"Auswählen",null,"Auswählen","Auswählen",null,"Auswählen","Auswählen"]
["Auswählen","Auswählen",{"$nulls":4},"Auswählen",null,"Auswählen","Auswählen",null,"Auswählen","Auswählen"]
["Auswählen","Auswählen",{"$nulls":4},"Auswählen",null,"Auswählen","Auswählen",null,"Auswählen","Auswählen"]
["Auswählen","Auswählen",{"$nulls":4},"Auswählen",null,"Auswählen","Auswählen",null,"Auswählen","Auswählen"]
["Auswählen","Auswählen",{"$nulls":4},"Auswählen",null,"Auswählen","Auswählen",null,"Auswählen","Auswählen"]
["Auswählen","Auswählen",{"$nulls":4},"Auswählen",null,"Auswählen","Auswählen",null,"Auswählen","Auswählen"]
["Auswählen","Auswählen",{"$nulls":4},"Auswählen",null,"Auswählen","Auswählen",null,"Auswählen","Auswählen"]
["Auswählen","Auswählen",{"$nulls":4},"Auswählen",null,"Auswählen","Auswählen",null,"Auswählen","Auswählen"]
["Auswählen","Auswählen",{"$nulls":4},"Auswählen",null,"Auswählen","Auswählen",null,"Auswählen","Auswählen"]
["Auswählen","Auswählen",{"$nulls":4},"Auswählen",null,"Auswählen","Auswählen",null,"Auswählen","Auswählen"]
["Auswählen","Auswählen",{"$nulls":4},"Auswählen",null,"Auswählen","Auswählen",null,"Auswählen","Auswählen"]
["Auswählen","Auswählen",{"$nulls":4},"Auswählen",null,"Auswählen","Auswählen",null,"Auswählen","Auswählen"]
["Auswählen","Auswählen",{"$nulls":4},"Auswählen",null,"Auswählen","Auswählen",null,"Auswählen","Auswählen"]
["Auswählen","Auswählen",{"$nulls":4},"Auswählen",null,"Auswählen","Auswählen",null,"Auswählen","Auswählen"]
["Auswählen","Auswählen",{"$nulls":4},"Auswählen",null,"Auswählen","Auswählen",null,"Auswählen","Auswählen"]
["Auswählen","Auswählen",{"$nulls":4},"Auswählen",null,"Auswählen","Auswählen",null,"Auswählen","Auswählen"]
["Auswählen","Auswählen",{"$nulls":4},"Auswählen",null,"Auswählen","Auswählen",null,"Auswählen","Auswählen"]
["Auswählen","Auswählen",{"$nulls":4},"Auswählen",null,"Auswählen","Auswählen",null,"Auswählen","Auswählen"]
["Auswählen","Auswählen",{"$nulls":4},"Auswählen",null,"Auswählen","Auswählen",null,"Auswählen","Auswählen"]
["Auswählen","Auswählen",{"$nulls":4},"Auswählen",null,"Auswählen","Auswählen",null,"Auswählen","Auswählen"]
["Auswählen","Auswählen",{"$nulls":4},"Auswählen",null,"Auswählen","Auswählen",null,"Auswählen","Auswählen"]
["Auswählen","Auswählen",{"$nulls":4},"Auswählen",null,"Auswählen","Auswählen",null,"Auswählen","Auswählen"]
["Auswählen","Auswählen",{"$nulls":4},"Auswählen",null,"Auswählen","Auswählen",null,"Auswählen","Auswählen"]
["Auswählen","Auswählen",{"$nulls":4},"Auswählen",null,"Auswählen","Auswählen",null,"Auswählen","Auswählen"]
["Auswählen","Auswählen",{"$nulls":4},"Auswählen",null,"Auswählen","Auswählen",null,"Auswählen","Auswählen"]
["Auswählen","Auswählen",{"$nulls":4},"Auswählen",null,"Auswählen","Auswählen",null,"Auswählen","Auswählen"]
["Auswählen","Auswählen",{"$nulls":4},"Auswählen",null,"Auswählen","Auswählen",null,"Auswählen","Auswählen"]
["Auswählen","Auswählen",{"$nulls":4},"Auswählen",null,"Auswählen","Auswählen",null,"Auswählen","Auswählen"]
["Auswählen","Auswählen",{"$nulls":4},"Auswählen",null,"Auswählen","Auswählen",null,"Auswählen","Auswählen"]
["Auswählen","Auswählen",{"$nulls":4},"Auswählen",null,"Auswählen","Auswählen",null,"Auswählen","Auswählen"]
["Auswählen","Auswählen",{"$nulls":4},"Auswählen",null,"Auswählen","Auswählen",null,"Auswählen","Auswählen"]
["Auswählen","Auswählen",{"$nulls":4},"Auswählen",null,"Auswählen","Auswählen",null,"Auswählen","Auswählen"]
["Auswählen","Auswählen",{"$nulls":4},"Auswählen",null,"Auswählen","Auswählen",null,"Auswählen","Auswählen"]
["Auswählen","Auswählen",{"$nulls":4},"Auswählen",null,"Auswählen","Auswählen",null,"Auswählen","Auswählen"]
["Auswählen","Auswählen",{"$nulls":4},"Auswählen",null,"Auswählen","Auswählen",null,"Auswählen","Auswählen"]
["Auswählen","Auswählen",{"$nulls":4},"Auswählen",null,"Auswählen","Auswählen",null,"Auswählen","Auswählen"]
["Auswählen","Auswählen",{"$nulls":4},"Auswählen",null,"Auswählen","Auswählen",null,"Auswählen","Auswählen"]
["Auswählen","Auswählen",{"$nulls":4},"Auswählen",null,"Auswählen","Auswählen",null,"Auswählen","Auswählen"]
["Auswählen","Auswählen",{"$nulls":4},"Auswählen",null,"Auswählen","Auswählen",null,"Auswählen","Auswählen"]
["Auswählen","Auswählen",{"$nulls":4},"Auswählen",null,"Auswählen","Auswählen",null,"Auswählen","Auswählen"]
["Auswählen","Auswählen",{"$nulls":4},"Auswählen",null,"Auswählen","Auswählen",null,"Auswählen","Auswählen"]
["Auswählen","Auswählen",{"$nulls":4},"Auswählen",null,"Auswählen","Auswählen",null,"Auswählen","Auswählen"]
["Auswählen","Auswählen",{"$nulls":4},"Auswählen",null,"Auswählen","Auswählen",null,"Auswählen","Auswählen"]
["Auswählen","Auswählen",{"$nulls":4},"Auswählen",null,"Auswählen","Auswählen",null,"Auswählen","Auswählen"]
["Auswählen","Auswählen",{"$nulls":4},"Auswählen",null,"Auswählen","Auswählen",null,"Auswählen","Auswählen"]
["Auswählen","Auswählen",{"$nulls":4},"Auswählen",null,"Auswählen","Auswählen",null,"Auswählen","Auswählen"]
["Auswählen","Auswählen",{"$nulls":4},"Auswählen",null,"Auswählen","Auswählen",null,"Auswählen","Auswählen"]
["Auswählen","Auswählen",{"$nulls":4},"Auswählen",null,"Auswählen","Auswählen",null,"Auswählen","Auswählen"]
["Auswählen","Auswählen",{"$nulls":4},"Auswählen",null,"Auswählen","Auswählen",null,"Auswählen","Auswählen"]
["Auswählen","Auswählen",{"$nulls":4},"Auswählen",null,"Auswählen","Auswählen",null,"Auswählen","Auswählen"]
["Auswählen","Auswählen",{"$nulls":4},"Auswählen",null,"Auswählen","Auswählen",null,"Auswählen","Auswählen"]
["Auswählen","Auswählen",{"$nulls":4},"Auswählen",null,"Auswählen","Auswählen",null,"Auswählen","Auswählen"]
["Auswählen","Auswählen",{"$nulls":4},"Auswählen",null,"Auswählen","Auswählen",null,"Auswählen","Auswählen"]
["Auswählen","Auswählen",{"$nulls":4},"Auswählen",null,"Auswählen","Auswählen",null,"Auswählen","Auswählen"]
["Auswählen","Auswählen",{"$nulls":4},"Auswählen",null,"Auswählen","Auswählen",null,"Auswählen","Auswählen"]
["Auswählen","Auswählen",{"$nulls":4},"Auswählen",null,"Auswählen","Auswählen",null,"Auswählen","Auswählen"]
["Auswählen","Auswählen",{"$nulls":4},"Auswählen",null,"Auswählen","Auswählen",null,"Auswählen","Auswählen"]
["Auswählen","Auswählen",{"$nulls":4},"Auswählen",null,"Auswählen","Auswählen",null,"Auswählen","Auswählen"]
["Auswählen","Auswählen",{"$nulls":4},"Auswählen",null,"Auswählen","Auswählen",null,"Auswählen","Auswählen"]
["Auswählen","Auswählen",{"$nulls":4},"Auswählen",null,"Auswählen","Auswählen",null,"Auswählen","Auswählen"]
["Auswählen","Auswählen",{"$nulls":4},"Auswählen",null,"Auswählen","Auswählen",null,"Auswählen","Auswählen"]
["Auswählen","Auswählen",{"$nulls":4},"Auswählen",null,"Auswählen","Auswählen",null,"Auswählen","Auswählen"]
["Auswählen","Auswählen",{"$nulls":4},"Auswählen",null,"Auswählen","Auswählen",null,"Auswählen","Auswählen"]
["Auswählen","Auswählen",{"$nulls":4},"Auswählen",null,"Auswählen","Auswählen",null,"Auswählen","Auswählen"]
["Auswählen","Auswählen",{"$nulls":4},"Auswählen",null,"Auswählen","Auswählen",null,"Auswählen","Auswählen"]
["Auswählen","Auswählen",{"$nulls":4},"Auswählen",null,"Auswählen","Auswählen",null,"Auswählen","Auswählen"]
["Auswählen","Auswählen",{"$nulls":4},"Auswählen",null,"Auswählen","Auswählen",null,"Auswählen","Auswählen"]
["Auswählen","Auswählen",{"$nulls":4},"Auswählen",null,"Auswählen","Auswählen",null,"Auswählen","Auswählen"]
["Auswählen","Auswählen",{"$nulls":4},"Auswählen",null,"Auswählen","Auswählen",null,"Auswählen","Auswählen"]
["Auswählen","Auswählen",{"$nulls":4},"Auswählen",null,"Auswählen","Auswählen",null,"Auswählen","Auswählen"]

{"sheet":"Hilfstab AE","index":6,"n_rows":38,"n_cols":9,"rows_kept":38,"merged":[[19,0,19,6],[20,0,20,6],[21,0,21,6],[22,0,22,6],[24,0,24,6],[25,0,25,6],[26,0,26,6],[27,0,27,6],[29,0,29,6],[30,0,30,6],[31,0,31,6],[32,0,32,6],[34,0,34,6],[35,0,35,6],[36,0,36,6],[37,0,37,6]]}
["Pensenausgleich für Lehrkräfte mit Altersentlastung"]
[]
["Verordnung zum Personalrecht der Volksschul-Lehrpersonen (sGS 213.14)"]
{"$rows_empty":11}
[{"$f":"Zusammenzug!B4","v":2024},"Jahr des Pensenplans"]
["AE56-60",{"$f":"+A15-56","v":1968},"bis",{"$f":"+A15-60","v":1964},"Jahrgänge AE mit",null,{"v":0.06286,"d":"6.286%"}]
["AE61+",{"$f":"+A15-61","v":1963},"und älter",null,"Jahrgänge AE mit",null,{"v":0.09429,"d":"9.429%"}]
[]
["(Klassen-)Lehrpersonen mit Altersentlastung AE56-60"]
["Eine Lehrperson (auch Klassenlehrpersonen) mit 100%-Anstellung arbeitet 2 Lektionen weniger, nämlich 26 von 28 Lektionen."]
["Die Lehrperson arbeitet theoretisch 92.857% (26/28). Die Differenz wird im Pensenplan mit 7.143% Pensum ausgeglichen.",{"$nulls":7},{"$f":"ROUND(26/28,5)","v":{"v":0.92857,"d":"92.857%"}}]
["Für Lehrpersonen im Teilzeitpensum wird die Gutschrift proportional berechnet. ",{"$nulls":7},{"$f":"100%-I21","v":{"v":0.07143,"d":"7.143%"}}]
["Bei Anstellungen unter 30% entfällt die Altersentlastung."]
["(Klassen-)Lehrpersonen mit Altersentlastung AE61+"]
["Eine Lehrperson (auch Klassenlehrpersonen) mit 100%-Anstellung arbeitet 2 Lektionen weniger, nämlich 25 von 28 Lektionen.",{"$nulls":7},{"$f":"ROUND(25/28,5)","v":{"v":0.89286,"d":"89.286%"}}]
["Die Lehrperson arbeitet theoretisch 89.286% (25/28). Die Differenz wird im Pensenplan mit 10.714% Pensum ausgeglichen.",{"$nulls":7},{"$f":"100%-I25","v":{"v":0.10714000000000001,"d":"10.714%"}}]
["Für Lehrpersonen im Teilzeitpensum wird die Gutschrift proportional berechnet. "]
["Bei Anstellungen unter 30% entfällt die Altersentlastung."]
["Fachlehrpersonen mit Altersentlastung AE56-60"]
["Eine Fachlehrperson mit 100%-Anstellung arbeitet 2 Lektionen weniger, nämlich 27 von 29 Lektionen.",{"$nulls":7},{"$f":"ROUND(27/29,5)","v":{"v":0.93103,"d":"93.103%"}}]
["Die Lehrperson arbeitet theoretisch 93.103% (27/29). Die Differenz wird im Pensenplan mit 6.897% Pensum ausgeglichen.",{"$nulls":7},{"$f":"100%-I30","v":{"v":0.06896999999999998,"d":"6.897%"}}]
["Für Lehrpersonen im Teilzeitpensum wird die Gutschrift proportional berechnet. "]
["Bei Anstellungen unter 30% entfällt die Altersentlastung."]
["Fachlehrpersonen mit Altersentlastung AE61+"]
["Eine Fachlehrperson mit 100%-Anstellung arbeitet 3 Lektionen weniger, nämlich 26 von 29 Lektionen.",{"$nulls":7},{"$f":"ROUND(26/29,5)","v":{"v":0.89655,"d":"89.655%"}}]
["Die Lehrperson arbeitet theoretisch 89.655% (26/29). Die Differenz wird im Pensenplan mit 10.345% Pensum ausgeglichen.",{"$nulls":7},{"$f":"100%-I35","v":{"v":0.10345000000000004,"d":"10.345%"}}]
["Für Lehrpersonen im Teilzeitpensum wird die Gutschrift proportional berechnet. "]
["Bei Anstellungen unter 30% entfällt die Altersentlastung."]

{"sheet":"Hilfstab Löhne","index":7,"n_rows":196,"n_cols":8,"rows_kept":196}
["Lohntabellen "]
["Einstufung","Lohnklasse","alt","Jahreslohn inkl. 13. ML","Monatslohn 1/13","StV pro Woche 1/39","StV Einzellektion 3.240%"]
["Auswählen","Auswählen",null,0]
["Primar/Kiga",1,"A1",{"v":94903.35,"d":"94,903.35"},{"v":7300.25,"d":"7,300.25"},{"v":2433.4,"d":"2,433.40"},78.85,"SHP mit LK 1"]
["Primar/Kiga",2,2,{"v":94903.35,"d":"94,903.35"},{"v":7300.25,"d":"7,300.25"},{"v":2433.4,"d":"2,433.40"},78.85,"SHP mit LK 1"]
["Primar/Kiga",3,3,{"v":94903.35,"d":"94,903.35"},{"v":7300.25,"d":"7,300.25"},{"v":2433.4,"d":"2,433.40"},78.85,"SHP mit LK 1"]
["Primar/Kiga",4,4,{"v":94903.35,"d":"94,903.35"},{"v":7300.25,"d":"7,300.25"},{"v":2433.4,"d":"2,433.40"},78.85,"SHP mit LK 1"]
["Primar/Kiga",5,"B1",{"v":94903.35,"d":"94,903.35"},{"v":7300.25,"d":"7,300.25"},{"v":2433.4,"d":"2,433.40"},78.85,"SHP mit LK 1"]
["Primar/Kiga",6,2,{"v":94903.35,"d":"94,903.35"},{"v":7300.25,"d":"7,300.25"},{"v":2433.4,"d":"2,433.40"},78.85,"SHP mit LK 1"]
["Primar/Kiga",7,3,{"v":94903.35,"d":"94,903.35"},{"v":7300.25,"d":"7,300.25"},{"v":2433.4,"d":"2,433.40"},78.85,"SHP mit LK 1"]
["Primar/Kiga",8,4,{"v":95505.3,"d":"95,505.30"},{"v":7346.55,"d":"7,346.55"},{"v":2448.85,"d":"2,448.85"},79.35]
["Primar/Kiga",9,5,{"v":98881.95,"d":"98,881.95"},{"v":7606.3,"d":"7,606.30"},{"v":2535.45,"d":"2,535.45"},82.15]
["Primar/Kiga",10,6,{"v":98881.95,"d":"98,881.95"},{"v":7606.3,"d":"7,606.30"},{"v":2535.45,"d":"2,535.45"},82.15]
["Primar/Kiga",11,7,{"v":98881.95,"d":"98,881.95"},{"v":7606.3,"d":"7,606.30"},{"v":2535.45,"d":"2,535.45"},82.15]
["Primar/Kiga",12,8,{"v":98881.95,"d":"98,881.95"},{"v":7606.3,"d":"7,606.30"},{"v":2535.45,"d":"2,535.45"},82.15]
["Primar/Kiga",13,"C1",{"v":102017.15,"d":"102,017.15"},{"v":7847.45,"d":"7,847.45"},{"v":2615.8,"d":"2,615.80"},84.75]
["Primar/Kiga",14,2,{"v":105152.5,"d":"105,152.50"},{"v":8088.65,"d":"8,088.65"},{"v":2696.2,"d":"2,696.20"},87.35]
["Primar/Kiga",15,3,{"v":108287.85,"d":"108,287.85"},{"v":8329.85,"d":"8,329.85"},{"v":2776.6,"d":"2,776.60"},89.95]
["Primar/Kiga",16,4,{"v":111423.1,"d":"111,423.10"},{"v":8571,"d":"8,571.00"},{"v":2857,"d":"2,857.00"},92.55]
["Primar/Kiga",17,5,{"v":114558.3,"d":"114,558.30"},{"v":8812.2,"d":"8,812.20"},{"v":2937.4,"d":"2,937.40"},95.15]
["Primar/Kiga",18,6,{"v":114558.3,"d":"114,558.30"},{"v":8812.2,"d":"8,812.20"},{"v":2937.4,"d":"2,937.40"},95.15]
["Primar/Kiga",19,7,{"v":114558.3,"d":"114,558.30"},{"v":8812.2,"d":"8,812.20"},{"v":2937.4,"d":"2,937.40"},95.15]
["Primar/Kiga",20,8,{"v":114558.3,"d":"114,558.30"},{"v":8812.2,"d":"8,812.20"},{"v":2937.4,"d":"2,937.40"},95.15]
["Primar/Kiga",21,9,{"v":114558.3,"d":"114,558.30"},{"v":8812.2,"d":"8,812.20"},{"v":2937.4,"d":"2,937.40"},95.15]
["Primar/Kiga",22,"D1",{"v":115763.9,"d":"115,763.90"},{"v":8904.9,"d":"8,904.90"},{"v":2968.3,"d":"2,968.30"},96.15]
["Primar/Kiga",23,2,{"v":117090.15,"d":"117,090.15"},{"v":9006.95,"d":"9,006.95"},{"v":3002.3,"d":"3,002.30"},97.25]
["Primar/Kiga",24,3,{"v":118295.6,"d":"118,295.60"},{"v":9099.65,"d":"9,099.65"},{"v":3033.2,"d":"3,033.20"},{"v":98.3,"d":"98.30"}]
["Primar/Kiga",25,4,{"v":119502.65,"d":"119,502.65"},{"v":9192.5,"d":"9,192.50"},{"v":3064.15,"d":"3,064.15"},{"v":99.3,"d":"99.30"}]
["Primar/Kiga",26,5,{"v":120828.9,"d":"120,828.90"},{"v":9294.55,"d":"9,294.55"},{"v":3098.2,"d":"3,098.20"},{"v":100.4,"d":"100.40"}]
["Primar/Kiga",27,6,{"v":122034.45,"d":"122,034.45"},{"v":9387.25,"d":"9,387.25"},{"v":3129.1,"d":"3,129.10"},{"v":101.4,"d":"101.40"}]
["SHP ohne",1,"A1",{"v":83205.6,"d":"83,205.60"},{"v":6400.45,"d":"6,400.45"},{"v":2133.5,"d":"2,133.50"},69.15]
["SHP ohne",2,2,{"v":86220.2,"d":"86,220.20"},{"v":6632.3,"d":"6,632.30"},{"v":2210.75,"d":"2,210.75"},71.65]
["SHP ohne",3,3,{"v":89234.8,"d":"89,234.80"},{"v":6864.2,"d":"6,864.20"},{"v":2288.05,"d":"2,288.05"},74.15]
["SHP ohne",4,4,{"v":89234.8,"d":"89,234.80"},{"v":6864.2,"d":"6,864.20"},{"v":2288.05,"d":"2,288.05"},74.15]
["SHP ohne",5,"B1",{"v":94058.45,"d":"94,058.45"},{"v":7235.25,"d":"7,235.25"},{"v":2411.75,"d":"2,411.75"},78.15]
["SHP ohne",6,2,{"v":98881.95,"d":"98,881.95"},{"v":7606.3,"d":"7,606.30"},{"v":2535.45,"d":"2,535.45"},82.15]
["SHP ohne",7,3,{"v":103705.65,"d":"103,705.65"},{"v":7977.35,"d":"7,977.35"},{"v":2659.1,"d":"2,659.10"},86.15]
["SHP ohne",8,4,{"v":108529.25,"d":"108,529.25"},{"v":8348.4,"d":"8,348.40"},{"v":2782.8,"d":"2,782.80"},90.15]
["SHP ohne",9,5,{"v":113352.9,"d":"113,352.90"},{"v":8719.45,"d":"8,719.45"},{"v":2906.5,"d":"2,906.50"},94.15]
["SHP ohne",10,6,{"v":113352.9,"d":"113,352.90"},{"v":8719.45,"d":"8,719.45"},{"v":2906.5,"d":"2,906.50"},94.15]
["SHP ohne",11,7,{"v":113352.9,"d":"113,352.90"},{"v":8719.45,"d":"8,719.45"},{"v":2906.5,"d":"2,906.50"},94.15]
["SHP ohne",12,8,{"v":113352.9,"d":"113,352.90"},{"v":8719.45,"d":"8,719.45"},{"v":2906.5,"d":"2,906.50"},94.15]
["SHP ohne",13,"C1",{"v":116367.45,"d":"116,367.45"},{"v":8951.35,"d":"8,951.35"},{"v":2983.8,"d":"2,983.80"},{"v":96.7,"d":"96.70"}]
["SHP ohne",14,2,{"v":119382,"d":"119,382.00"},{"v":9183.25,"d":"9,183.25"},{"v":3061.1,"d":"3,061.10"},{"v":99.2,"d":"99.20"}]
["SHP ohne",15,3,{"v":122396.55,"d":"122,396.55"},{"v":9415.1,"d":"9,415.10"},{"v":3138.35,"d":"3,138.35"},{"v":101.7,"d":"101.70"}]
["SHP ohne",16,4,{"v":125411.3,"d":"125,411.30"},{"v":9647,"d":"9,647.00"},{"v":3215.65,"d":"3,215.65"},{"v":104.2,"d":"104.20"}]
["SHP ohne",17,5,{"v":128425.85,"d":"128,425.85"},{"v":9878.9,"d":"9,878.90"},{"v":3292.95,"d":"3,292.95"},{"v":106.7,"d":"106.70"}]
["SHP ohne",18,6,{"v":128425.85,"d":"128,425.85"},{"v":9878.9,"d":"9,878.90"},{"v":3292.95,"d":"3,292.95"},{"v":106.7,"d":"106.70"}]
["SHP ohne",19,7,{"v":128425.85,"d":"128,425.85"},{"v":9878.9,"d":"9,878.90"},{"v":3292.95,"d":"3,292.95"},{"v":106.7,"d":"106.70"}]
["SHP ohne",20,8,{"v":128425.85,"d":"128,425.85"},{"v":9878.9,"d":"9,878.90"},{"v":3292.95,"d":"3,292.95"},{"v":106.7,"d":"106.70"}]
["SHP ohne",21,9,{"v":128425.85,"d":"128,425.85"},{"v":9878.9,"d":"9,878.90"},{"v":3292.95,"d":"3,292.95"},{"v":106.7,"d":"106.70"}]
["SHP ohne",22,"D1",{"v":129631.25,"d":"129,631.25"},{"v":9971.65,"d":"9,971.65"},{"v":3323.9,"d":"3,323.90"},{"v":107.7,"d":"107.70"}]
["SHP ohne",23,2,{"v":130836.8,"d":"130,836.80"},{"v":10064.35,"d":"10,064.35"},{"v":3354.8,"d":"3,354.80"},{"v":108.7,"d":"108.70"}]
["SHP ohne",24,3,{"v":132043.85,"d":"132,043.85"},{"v":10157.2,"d":"10,157.20"},{"v":3385.75,"d":"3,385.75"},{"v":109.7,"d":"109.70"}]
["SHP ohne",25,4,{"v":133249.35,"d":"133,249.35"},{"v":10249.95,"d":"10,249.95"},{"v":3416.65,"d":"3,416.65"},{"v":110.7,"d":"110.70"}]
["SHP mit",1,"A1",{"v":94903.35,"d":"94,903.35"},{"v":7300.25,"d":"7,300.25"},{"v":2433.4,"d":"2,433.40"},78.85]
["SHP mit",2,2,{"v":99002.75,"d":"99,002.75"},{"v":7615.6,"d":"7,615.60"},{"v":2538.55,"d":"2,538.55"},82.25]
["SHP mit",3,3,{"v":103102.2,"d":"103,102.20"},{"v":7930.95,"d":"7,930.95"},{"v":2643.65,"d":"2,643.65"},85.65]
["SHP mit",4,4,{"v":103102.2,"d":"103,102.20"},{"v":7930.95,"d":"7,930.95"},{"v":2643.65,"d":"2,643.65"},85.65]
["SHP mit",5,"B1",{"v":107322.15,"d":"107,322.15"},{"v":8255.55,"d":"8,255.55"},{"v":2751.85,"d":"2,751.85"},89.15]
["SHP mit",6,2,{"v":111543.8,"d":"111,543.80"},{"v":8580.3,"d":"8,580.30"},{"v":2860.1,"d":"2,860.10"},92.65]
["SHP mit",7,3,{"v":115763.9,"d":"115,763.90"},{"v":8904.9,"d":"8,904.90"},{"v":2968.3,"d":"2,968.30"},96.15]
["SHP mit",8,4,{"v":119985.65,"d":"119,985.65"},{"v":9229.65,"d":"9,229.65"},{"v":3076.55,"d":"3,076.55"},{"v":99.7,"d":"99.70"}]
["SHP mit",9,5,{"v":119985.65,"d":"119,985.65"},{"v":9229.65,"d":"9,229.65"},{"v":3076.55,"d":"3,076.55"},{"v":99.7,"d":"99.70"}]
["SHP mit",10,6,{"v":119985.65,"d":"119,985.65"},{"v":9229.65,"d":"9,229.65"},{"v":3076.55,"d":"3,076.55"},{"v":99.7,"d":"99.70"}]
["SHP mit",11,7,{"v":119985.65,"d":"119,985.65"},{"v":9229.65,"d":"9,229.65"},{"v":3076.55,"d":"3,076.55"},{"v":99.7,"d":"99.70"}]
["SHP mit",12,"C1",{"v":123964.2,"d":"123,964.20"},{"v":9535.7,"d":"9,535.70"},{"v":3178.55,"d":"3,178.55"},{"v":103,"d":"103.00"}]
["SHP mit",13,2,{"v":127942.8,"d":"127,942.80"},{"v":9841.75,"d":"9,841.75"},{"v":3280.6,"d":"3,280.60"},{"v":106.3,"d":"106.30"}]
["SHP mit",14,3,{"v":131923.15,"d":"131,923.15"},{"v":10147.95,"d":"10,147.95"},{"v":3382.65,"d":"3,382.65"},{"v":109.6,"d":"109.60"}]
["SHP mit",15,4,{"v":135901.8,"d":"135,901.80"},{"v":10454,"d":"10,454.00"},{"v":3484.65,"d":"3,484.65"},{"v":112.9,"d":"112.90"}]
["SHP mit",16,5,{"v":139881.95,"d":"139,881.95"},{"v":10760.15,"d":"10,760.15"},{"v":3586.7,"d":"3,586.70"},{"v":116.2,"d":"116.20"}]
["SHP mit",17,6,{"v":139881.95,"d":"139,881.95"},{"v":10760.15,"d":"10,760.15"},{"v":3586.7,"d":"3,586.70"},{"v":116.2,"d":"116.20"}]
["SHP mit",18,7,{"v":139881.95,"d":"139,881.95"},{"v":10760.15,"d":"10,760.15"},{"v":3586.7,"d":"3,586.70"},{"v":116.2,"d":"116.20"}]
["SHP mit",19,8,{"v":139881.95,"d":"139,881.95"},{"v":10760.15,"d":"10,760.15"},{"v":3586.7,"d":"3,586.70"},{"v":116.2,"d":"116.20"}]
["SHP mit",20,9,{"v":139881.95,"d":"139,881.95"},{"v":10760.15,"d":"10,760.15"},{"v":3586.7,"d":"3,586.70"},{"v":116.2,"d":"116.20"}]
["SHP mit",21,10,{"v":139881.95,"d":"139,881.95"},{"v":10760.15,"d":"10,760.15"},{"v":3586.7,"d":"3,586.70"},{"v":116.2,"d":"116.20"}]
["SHP mit",22,"D1",{"v":140484.05,"d":"140,484.05"},{"v":10806.45,"d":"10,806.45"},{"v":3602.15,"d":"3,602.15"},{"v":116.7,"d":"116.70"}]
["SHP mit",23,2,{"v":141087.55,"d":"141,087.55"},{"v":10852.9,"d":"10,852.90"},{"v":3617.65,"d":"3,617.65"},{"v":117.2,"d":"117.20"}]
["SHP mit",24,3,{"v":141691.1,"d":"141,691.10"},{"v":10899.3,"d":"10,899.30"},{"v":3633.1,"d":"3,633.10"},{"v":117.7,"d":"117.70"}]
["SHP mit",25,4,{"v":142293.15,"d":"142,293.15"},{"v":10945.65,"d":"10,945.65"},{"v":3648.55,"d":"3,648.55"},{"v":118.2,"d":"118.20"}]
["OS",{"$f":"+B56","v":1},"A1",{"v":94903.35,"d":"94,903.35"},{"v":7300.25,"d":"7,300.25"},{"v":2433.4,"d":"2,433.40"},78.85]
["OS",2,2,{"v":99002.75,"d":"99,002.75"},{"v":7615.6,"d":"7,615.60"},{"v":2538.55,"d":"2,538.55"},82.25]
["OS",3,3,{"v":103102.2,"d":"103,102.20"},{"v":7930.95,"d":"7,930.95"},{"v":2643.65,"d":"2,643.65"},85.65]
["OS",4,4,{"v":103102.2,"d":"103,102.20"},{"v":7930.95,"d":"7,930.95"},{"v":2643.65,"d":"2,643.65"},85.65]
["OS",5,"B1",{"v":107322.15,"d":"107,322.15"},{"v":8255.55,"d":"8,255.55"},{"v":2751.85,"d":"2,751.85"},89.15]
["OS",6,2,{"v":111543.8,"d":"111,543.80"},{"v":8580.3,"d":"8,580.30"},{"v":2860.1,"d":"2,860.10"},92.65]
["OS",7,3,{"v":115763.9,"d":"115,763.90"},{"v":8904.9,"d":"8,904.90"},{"v":2968.3,"d":"2,968.30"},96.15]
["OS",8,4,{"v":119985.65,"d":"119,985.65"},{"v":9229.65,"d":"9,229.65"},{"v":3076.55,"d":"3,076.55"},{"v":99.7,"d":"99.70"}]
["OS",9,5,{"v":119985.65,"d":"119,985.65"},{"v":9229.65,"d":"9,229.65"},{"v":3076.55,"d":"3,076.55"},{"v":99.7,"d":"99.70"}]
["OS",10,6,{"v":119985.65,"d":"119,985.65"},{"v":9229.65,"d":"9,229.65"},{"v":3076.55,"d":"3,076.55"},{"v":99.7,"d":"99.70"}]
["OS",11,7,{"v":119985.65,"d":"119,985.65"},{"v":9229.65,"d":"9,229.65"},{"v":3076.55,"d":"3,076.55"},{"v":99.7,"d":"99.70"}]
["OS",12,"C1",{"v":123964.2,"d":"123,964.20"},{"v":9535.7,"d":"9,535.70"},{"v":3178.55,"d":"3,178.55"},{"v":103,"d":"103.00"}]
["OS",13,2,{"v":127942.8,"d":"127,942.80"},{"v":9841.75,"d":"9,841.75"},{"v":3280.6,"d":"3,280.60"},{"v":106.3,"d":"106.30"}]
["OS",14,3,{"v":131923.15,"d":"131,923.15"},{"v":10147.95,"d":"10,147.95"},{"v":3382.65,"d":"3,382.65"},{"v":109.6,"d":"109.60"}]
["OS",15,4,{"v":135901.8,"d":"135,901.80"},{"v":10454,"d":"10,454.00"},{"v":3484.65,"d":"3,484.65"},{"v":112.9,"d":"112.90"}]
["OS",16,5,{"v":139881.95,"d":"139,881.95"},{"v":10760.15,"d":"10,760.15"},{"v":3586.7,"d":"3,586.70"},{"v":116.2,"d":"116.20"}]
["OS",{"$f":"+B72","v":17},6,{"v":139881.95,"d":"139,881.95"},{"v":10760.15,"d":"10,760.15"},{"v":3586.7,"d":"3,586.70"},{"v":116.2,"d":"116.20"}]
["OS",18,7,{"v":139881.95,"d":"139,881.95"},{"v":10760.15,"d":"10,760.15"},{"v":3586.7,"d":"3,586.70"},{"v":116.2,"d":"116.20"}]
["OS",19,8,{"v":139881.95,"d":"139,881.95"},{"v":10760.15,"d":"10,760.15"},{"v":3586.7,"d":"3,586.70"},{"v":116.2,"d":"116.20"}]
["OS",20,9,{"v":139881.95,"d":"139,881.95"},{"v":10760.15,"d":"10,760.15"},{"v":3586.7,"d":"3,586.70"},{"v":116.2,"d":"116.20"}]
["OS",21,10,{"v":139881.95,"d":"139,881.95"},{"v":10760.15,"d":"10,760.15"},{"v":3586.7,"d":"3,586.70"},{"v":116.2,"d":"116.20"}]
["OS",22,"D1",{"v":140484.05,"d":"140,484.05"},{"v":10806.45,"d":"10,806.45"},{"v":3602.15,"d":"3,602.15"},{"v":116.7,"d":"116.70"}]
["OS",23,2,{"v":141087.55,"d":"141,087.55"},{"v":10852.9,"d":"10,852.90"},{"v":3617.65,"d":"3,617.65"},{"v":117.2,"d":"117.20"}]
["OS",24,3,{"v":141691.1,"d":"141,691.10"},{"v":10899.3,"d":"10,899.30"},{"v":3633.1,"d":"3,633.10"},{"v":117.7,"d":"117.70"}]
["OS",25,4,{"v":142293.15,"d":"142,293.15"},{"v":10945.65,"d":"10,945.65"},{"v":3648.55,"d":"3,648.55"},{"v":118.2,"d":"118.20"}]
["SHP mit Kl. 1",{"$f":"+B56","v":1},"A1",{"v":94903.35,"d":"94,903.35"},{"v":7300.25,"d":"7,300.25"},{"v":2433.4,"d":"2,433.40"},78.85]
["SHP mit 85%",1,"A1",{"$f":"ROUND(D56*0.85/5,2)*5","v":{"v":80667.85,"d":"80,667.85"}},{"$f":"ROUND(E56*0.85/5,2)*5","v":{"v":6205.2,"d":"6,205.20"}},{"v":2068.4,"d":"2,068.40"},{"v":67,"d":"67.00"}]
["SHP mit 85%",2,2,{"$f":"ROUND(D57*0.85/5,2)*5","v":{"v":84152.35,"d":"84,152.35"}},{"v":6473.25,"d":"6,473.25"},{"v":2157.75,"d":"2,157.75"},{"v":69.9,"d":"69.90"}]
["SHP mit 85%",3,3,{"v":87636.84999999999,"d":"87,636.85"},{"v":6741.3,"d":"6,741.30"},{"v":2247.1,"d":"2,247.10"},{"v":72.8,"d":"72.80"}]
["SHP mit 85%",4,4,{"v":87636.84999999999,"d":"87,636.85"},{"v":6741.3,"d":"6,741.30"},{"v":2247.1,"d":"2,247.10"},{"v":72.8,"d":"72.80"}]
["SHP mit 85%",5,"B1",{"v":91223.85,"d":"91,223.85"},{"v":7017.200000000001,"d":"7,017.20"},{"v":2339.05,"d":"2,339.05"},{"v":75.8,"d":"75.80"}]
["SHP mit 85%",6,2,{"v":94812.25,"d":"94,812.25"},{"v":7293.25,"d":"7,293.25"},{"v":2431.1000000000004,"d":"2,431.10"},78.75]
["SHP mit 85%",7,3,{"v":98399.3,"d":"98,399.30"},{"v":7569.15,"d":"7,569.15"},{"v":2523.05,"d":"2,523.05"},81.75]
["SHP mit 85%",8,4,{"v":101987.8,"d":"101,987.80"},{"v":7845.2,"d":"7,845.20"},{"v":2615.05,"d":"2,615.05"},84.75]
["SHP mit 85%",9,5,{"v":101987.8,"d":"101,987.80"},{"v":7845.2,"d":"7,845.20"},{"v":2615.05,"d":"2,615.05"},84.75]
["SHP mit 85%",10,6,{"v":101987.8,"d":"101,987.80"},{"v":7845.2,"d":"7,845.20"},{"v":2615.05,"d":"2,615.05"},84.75]
["SHP mit 85%",11,7,{"v":101987.8,"d":"101,987.80"},{"v":7845.2,"d":"7,845.20"},{"v":2615.05,"d":"2,615.05"},84.75]
["SHP mit 85%",12,"C1",{"v":105369.55,"d":"105,369.55"},{"v":8105.349999999999,"d":"8,105.35"},{"v":2701.75,"d":"2,701.75"},{"v":87.55000000000001,"d":"87.55"}]
["SHP mit 85%",13,2,{"v":108751.4,"d":"108,751.40"},{"v":8365.5,"d":"8,365.50"},{"v":2788.5,"d":"2,788.50"},90.35]
["SHP mit 85%",14,null,"ungültige Klasse"]
["SHP mit 85%",15,null,"ungültige Klasse"]
["SHP mit 85%",16,null,"ungültige Klasse"]
["SHP mit 85%",17,null,"ungültige Klasse"]
["SHP mit 85%",18,null,"ungültige Klasse"]
["SHP mit 85%",19,null,"ungültige Klasse"]
["SHP mit 85%",20,null,"ungültige Klasse"]
["SHP mit 85%",21,null,"ungültige Klasse"]
["SHP mit 85%",22,null,"ungültige Klasse"]
["SHP mit 85%",23,null,"ungültige Klasse"]
["SHP mit 85%",24,null,"ungültige Klasse"]
["SHP mit 85%",25,null,"ungültige Klasse"]
["SHP mit 85%",26,null,"ungültige Klasse"]
["SHP mit 85%",27,null,"ungültige Klasse"]
["SHP ohne 85%",1,"A1",{"$f":"ROUND(D31*0.85/5,2)*5","v":{"v":70724.75,"d":"70,724.75"}},{"$f":"ROUND(E31*0.85/5,2)*5","v":{"v":5440.4,"d":"5,440.40"}},{"v":1813.5,"d":"1,813.50"},{"v":58.8,"d":"58.80"}]
["SHP ohne 85%",2,2,{"$f":"ROUND(D32*0.85/5,2)*5","v":{"v":73287.15,"d":"73,287.15"}},{"v":5637.45,"d":"5,637.45"},{"v":1879.1499999999999,"d":"1,879.15"},{"v":60.9,"d":"60.90"}]
["SHP ohne 85%",3,3,{"$f":"ROUND(D33*0.85/5,2)*5","v":{"v":75849.6,"d":"75,849.60"}},{"v":5834.55,"d":"5,834.55"},{"v":1944.8500000000001,"d":"1,944.85"},63.05]
["SHP ohne 85%",4,4,{"$f":"ROUND(D34*0.85/5,2)*5","v":{"v":75849.6,"d":"75,849.60"}},{"v":5834.55,"d":"5,834.55"},{"v":1944.8500000000001,"d":"1,944.85"},63.05]
["SHP ohne 85%",5,"B1",{"$f":"ROUND(D35*0.85/5,2)*5","v":{"v":79949.7,"d":"79,949.70"}},{"v":6149.95,"d":"6,149.95"},{"v":2050,"d":"2,050.00"},{"v":66.44999999999999,"d":"66.45"}]
["SHP ohne 85%",6,2,{"$f":"ROUND(D36*0.85/5,2)*5","v":{"v":84049.65,"d":"84,049.65"}},{"v":6465.349999999999,"d":"6,465.35"},{"v":2155.1499999999996,"d":"2,155.15"},{"v":69.85000000000001,"d":"69.85"}]
["SHP ohne 85%",7,3,{"$f":"ROUND(D37*0.85/5,2)*5","v":{"v":88149.79999999999,"d":"88,149.80"}},{"v":6780.75,"d":"6,780.75"},{"v":2260.25,"d":"2,260.25"},73.25]
["SHP ohne 85%",8,4,{"$f":"ROUND(D38*0.85/5,2)*5","v":{"v":92249.85,"d":"92,249.85"}},{"v":7096.15,"d":"7,096.15"},{"v":2365.4,"d":"2,365.40"},76.65]
["SHP ohne 85%",9,5,{"$f":"ROUND(D39*0.85/5,2)*5","v":{"v":96349.95000000001,"d":"96,349.95"}},{"v":7411.549999999999,"d":"7,411.55"},{"v":2470.55,"d":"2,470.55"},{"v":80.05000000000001,"d":"80.05"}]
["SHP ohne 85%",10,6,{"$f":"ROUND(D40*0.85/5,2)*5","v":{"v":96349.95000000001,"d":"96,349.95"}},{"v":7411.549999999999,"d":"7,411.55"},{"v":2470.55,"d":"2,470.55"},{"v":80.05000000000001,"d":"80.05"}]
["SHP ohne 85%",11,7,{"$f":"ROUND(D41*0.85/5,2)*5","v":{"v":96349.95000000001,"d":"96,349.95"}},{"v":7411.549999999999,"d":"7,411.55"},{"v":2470.55,"d":"2,470.55"},{"v":80.05000000000001,"d":"80.05"}]
["SHP ohne 85%",12,"C1",{"$f":"ROUND(D42*0.85/5,2)*5","v":{"v":96349.95000000001,"d":"96,349.95"}},{"v":7411.549999999999,"d":"7,411.55"},{"v":2470.55,"d":"2,470.55"},{"v":80.05000000000001,"d":"80.05"}]
["SHP ohne 85%",13,2,{"$f":"ROUND(D43*0.85/5,2)*5","v":{"v":98912.35,"d":"98,912.35"}},{"v":7608.65,"d":"7,608.65"},{"v":2536.25,"d":"2,536.25"},{"v":82.2,"d":"82.20"}]
["SHP ohne 85%",14,null,"ungültige Klasse"]
["SHP ohne 85%",15,null,"ungültige Klasse"]
["SHP ohne 85%",16,null,"ungültige Klasse"]
["SHP ohne 85%",17,null,"ungültige Klasse"]
["SHP ohne 85%",18,null,"ungültige Klasse"]
["SHP ohne 85%",19,null,"ungültige Klasse"]
["SHP ohne 85%",20,null,"ungültige Klasse"]
["SHP ohne 85%",21,null,"ungültige Klasse"]
["SHP ohne 85%",22,null,"ungültige Klasse"]
["SHP ohne 85%",23,null,"ungültige Klasse"]
["SHP ohne 85%",24,null,"ungültige Klasse"]
["SHP ohne 85%",25,null,"ungültige Klasse"]
["SH Kiga",1,"A1",{"$f":"ROUND((D4*1.02)/5,2)*5","v":{"v":96801.4,"d":"96,801.40"}}]
["SH Kiga",2,2,{"$f":"ROUND((D5*1.02)/5,2)*5","v":{"v":96801.4,"d":"96,801.40"}}]
["SH Kiga",3,3,{"v":96801.4,"d":"96,801.40"}]
["SH Kiga",4,4,{"v":96801.4,"d":"96,801.40"}]
["SH Kiga",5,"B1",{"v":96801.4,"d":"96,801.40"}]
["SH Kiga",6,2,{"v":96801.4,"d":"96,801.40"}]
["SH Kiga",7,3,{"v":96801.4,"d":"96,801.40"}]
["SH Kiga",8,4,{"v":97415.40000000001,"d":"97,415.40"}]
["SH Kiga",9,5,{"v":100859.59999999999,"d":"100,859.60"}]
["SH Kiga",10,6,{"v":100859.59999999999,"d":"100,859.60"}]
["SH Kiga",11,7,{"v":100859.59999999999,"d":"100,859.60"}]
["SH Kiga",12,8,{"v":100859.59999999999,"d":"100,859.60"}]
["SH Kiga",13,"C1",{"v":104057.5,"d":"104,057.50"}]
["SH Kiga",14,2,{"v":107255.55,"d":"107,255.55"}]
["SH Kiga",15,3,{"v":110453.6,"d":"110,453.60"}]
["SH Kiga",16,4,{"v":113651.55,"d":"113,651.55"}]
["SH Kiga",17,5,{"v":116849.45,"d":"116,849.45"}]
["SH Kiga",18,6,{"v":116849.45,"d":"116,849.45"}]
["SH Kiga",19,7,{"v":116849.45,"d":"116,849.45"}]
["SH Kiga",20,8,{"v":116849.45,"d":"116,849.45"}]
["SH Kiga",21,9,{"v":116849.45,"d":"116,849.45"}]
["SH Kiga",22,"D1",{"v":118079.2,"d":"118,079.20"}]
["SH Kiga",23,2,{"v":119431.95,"d":"119,431.95"}]
["SH Kiga",24,3,{"v":120661.5,"d":"120,661.50"}]
["SH Kiga",25,4,{"v":121892.70000000001,"d":"121,892.70"}]
["SH Kiga",26,5,{"v":123245.5,"d":"123,245.50"}]
["SH Kiga",27,6,{"v":124475.15,"d":"124,475.15"}]
["BVO Klasse 1 Minimum",null,null,{"v":33828.6,"d":"33,828.60"}]
["BVO Klasse 9 Maximum",null,null,{"v":66982.5,"d":"66,982.50"}]
[]
[]
["Primar/Kiga",1,"A1",{"v":74763.9,"d":"74,763.90"},{"v":5751.05,"d":"5,751.05"},{"v":1917,"d":"1,917.00"},{"v":62.1,"d":"62.10"}]
["Primar/Kiga",2,2,{"v":78382.05,"d":"78,382.05"},{"v":6029.4,"d":"6,029.40"},{"v":2009.8,"d":"2,009.80"},{"v":65.1,"d":"65.10"}]
["Primar/Kiga",3,3,{"v":82000.1,"d":"82,000.10"},{"v":6307.7,"d":"6,307.70"},{"v":2102.55,"d":"2,102.55"},{"v":68.1,"d":"68.10"}]
["Primar/Kiga",4,4,{"v":82000.1,"d":"82,000.10"},{"v":6307.7,"d":"6,307.70"},{"v":2102.55,"d":"2,102.55"},{"v":68.1,"d":"68.10"}]
["Primar/Kiga",5,"B1",{"v":85375.3,"d":"85,375.30"},{"v":6567.35,"d":"6,567.35"},{"v":2189.1,"d":"2,189.10"},70.95]
["Primar/Kiga",6,2,{"v":88751.85,"d":"88,751.85"},{"v":6827.05,"d":"6,827.05"},{"v":2275.7,"d":"2,275.70"},73.75]
["Primar/Kiga",7,3,{"v":92128.65,"d":"92,128.65"},{"v":7086.8,"d":"7,086.80"},{"v":2362.25,"d":"2,362.25"},76.55]

{"sheet":"Hilfstab Auswahl SOPÄ","index":8,"n_rows":32,"n_cols":18,"rows_kept":32,"merged":[[3,6,3,7],[3,11,3,12],[3,14,3,16]]}
["Auswahllisten für den Sonderschulbereich"]
[]
["Dropdowns",{"$nulls":5},"Hilfswerte"]
["Lohnklasse","1. Arbeitsjahr?","Lohntabelle","Lohntabelle","SHP in Ausbildung?",null,"Zuordnung Kürzel",null,null,"Entlastung Berufseinführung",null,"Berechnungsgrundlage Altersentlastung",null,null,"Dropdown und Anrechnung Pensen"]
["Auswählen",null,"Auswählen","Auswählen",null,null,"Lohnklasse","Kürzel",null,{"v":0.03571,"d":"3.571%"},null,"Art der Altersentlastung","Entlastung",null,"Einstufung","Prozent","Lohn (Max)"]
["Klassenlehrperson","ja","SHP mit",1,"ja",null,"Auswählen","leer",{"$nulls":3},"LP AE56-60",{"v":0.07143,"d":"7.143%"},null,"Auswählen",null,{"v":0,"d":"0.00"}]
["Standard-Lehrperson",null,"SHP ohne",{"$f":"1+D6","v":2},null,null,"Klassenlehrperson","KLP",{"$nulls":3},"LP AE61+",{"v":0.10714000000000001,"d":"10.714%"},null,"Assistenz ab BVO 9 Max.",{"v":1,"d":"100%"},{"v":142293.15,"d":"142,293.15"}]
["Fachlehrperson",null,"OS",3,null,null,"Standard-Lehrperson","LP",{"$nulls":3},"KLP AE56-60",{"$f":"+M6","v":{"v":0.07143,"d":"7.143%"}},null,"Assistenz bis BVO 9 Max.",{"v":0.5,"d":"50%"},{"v":66982.5,"d":"66,982.50"},"jährlich zu prüfen"]
[null,null,"SHP mit Kl. 1",4,null,null,"Fachlehrperson","FLP",{"$nulls":3},"KLP AE61+",{"$f":"+M7","v":{"v":0.10714000000000001,"d":"10.714%"}},null,"Praktikum bis BVO 3 Max.",{"v":0.25,"d":"25%"},{"v":47702.2,"d":"47,702.20"},"jährlich zu prüfen"]
[null,null,"Primar/Kiga",5,{"$nulls":7},"FLP AE56-60",{"v":0.06896999999999998,"d":"6.897%"},null,"FABE  Erstausbildung","0%",{"$f":"1370*13","v":{"v":17810,"d":"17,810.00"}},"jährlich zu prüfen,savoirsocial"]
[null,null,"SHP mit 85%",6,{"$nulls":7},"FLP AE61+",{"v":0.10345000000000004,"d":"10.345%"},null,"Andere",{"v":1,"d":"100%"},{"v":142293.15,"d":"142,293.15"}]
[null,null,"SHP ohne 85%",7]
[null,null,"SH Kiga",8]
[{"$nulls":3},9]
[{"$nulls":3},10]
[{"$nulls":3},11]
[{"$nulls":3},12]
[{"$nulls":3},13]
[{"$nulls":3},14]
[{"$nulls":3},15]
[{"$nulls":3},16]
[{"$nulls":3},17]
[{"$nulls":3},18]
[{"$nulls":3},19]
[{"$nulls":3},20]
[{"$nulls":3},21]
[{"$nulls":3},22]
[{"$nulls":3},23]
[{"$nulls":3},24]
[{"$nulls":3},25]
[{"$nulls":3},26]
[{"$nulls":3},27]

{"sheet":"Hilfstab SSP","index":9,"n_rows":205,"n_cols":15,"rows_kept":205}
["Auswahllisten der Statistik des Schulpersonals"]
["Nationality","Nationality_Label","Status","Status_Label","Qualification","Qualification_Label","cat_Pers","cat_Pers_Label","classSchArt_10","classSchArt","classSchArt_Label","Sex","Sex_Label","Inst","Inst_Label"]
[null,"Auswählen",null,"Auswählen",null,"Auswählen",null,"Auswählen",null,null,"Auswählen",null,"Auswählen",null,"nicht statistikpflichtig"]
[8100,"Schweiz",1,"Unbefristetet",11,"Lehrperson: SHP Diplom",null,"nicht statistikpflichtig",201,10090500,"Kindergarten",2,"F",null,"Auswählen"]
[8207,"Deutschland",2,"Befristetet",12,"Lehrperson: Anderes Lehrdiplom",10,"Lehrperson",202,10190500,"Primarstufe",1,"M",40887368,"Bad Sonder, Teufen (AR)"]
[8222,"Liechtenstein",null,null,14,"Lehrperson: Kein Diplom",41,"Logopädie",203,10290500,"Oberstufe",null,null,41600201,"CP-Schule, St.Gallen"]
[8229,"Österreich",null,null,31,"Logopädie, Psychomotorik: Diplom",42,"Psychomotorik ",204,10190000,"Kindergarten + Primarstufe",null,null,41095985,"Evangelisches Schulheim Langhalde, Abtwil"]
[8501,"Afghanistan",null,null,32,"Logopädie, Psychomotorik: Anderes oder kein Diplom",null,"Auswählen",205,10290000,"Primar- + Oberstufe",null,null,41742167,"Heilpädagogische Schule Seidenbaum, Trübbach"]
[8359,"Ägypten",null,null,21,"Schulleitung: Lehrdiplom",31,"B&U an Volksschulen",999,10290500,"Oberstufe + Fortgesetzte Sonderschulung",null,null,41632140,"Heilpädagogische Schule Flawil"]
[8201,"Albanien",null,null,22,"Schulleitung: Spezifisches Schulleitungsdiplom",41,"Logopädie an Volksschulen",207,67000,"Fortgesetzte Sonderschulung",null,null,41603820,"Heilpädagogische Schule Heerbrugg"]
[8304,"Algerien",null,null,23,"Schulleitung: Allgemeines Managementdiplom",42,"Psychomotorik an Volksschulen",206,10090000,"Alle Stufen (obligatorische Schule)",null,null,41623586,"Heilpädagogische Schule St.Gallen"]
[8202,"Andorra",null,null,24,"Schulleitung: Anderes Diplom",20,"Schulleitung",null,null,"Schulleitung",null,null,41200967,"Heilpädagogische Schule Stiftung Balm, Rapperswil"]
[8305,"Angola",{"$nulls":8},"nicht statistikpflichtig",null,null,63141231,"Heilpädagogische Schule Stiftung Balm, Standort Schänis"]
[8442,"Antigua und Barbuda",{"$nulls":11},51526941,"Heilpädagogische Schule Toggenburg, Wattwil"]
[8301,"Äquatorialguinea",{"$nulls":11},50208478,"Heilpädagogische Schule Wiggenhof, Rorschacherberg"]
[8401,"Argentinien",{"$nulls":11},52453237,"Heim Oberfeld, Marbach"]
[8560,"Armenien",{"$nulls":11},41155487,"Kinder Dörfli, Lütisburg"]
[8561,"Aserbaidschan",{"$nulls":11},10971877,"Lernpark Seidenbaum, Azmoos"]
[8302,"Äthiopien",{"$nulls":11},63912930,"Schulheim Hochsteig, Lichtensteig"]
[8601,"Australien",{"$nulls":11},10971924,"Schulheim Hochsteig, Uznach"]
[8402,"Bahamas",{"$nulls":11},41719875,"Sonderschule Stiftung Kronbühl, Wittenbach"]
[8502,"Bahrain",{"$nulls":11},61743376,"Sonderschule tipiti Jahrzeitenhaus, St.Gallen"]
[8546,"Bangladesch",{"$nulls":11},41712822,"Sonderschulheim Johanneum, Neu St. Johann"]
[8403,"Barbados",{"$nulls":11},46805803,"Sonderschulinternat Hemberg"]
[8266,"Belarus",{"$nulls":11},41107609,"Sprachheilschule St.Gallen"]
[8204,"Belgien",{"$nulls":11},10971919,"Sprachheilschule St.Gallen, Standort Rheintal, Balgach"]
[8419,"Belize",{"$nulls":11},10275378,"Sprachheilschule St.Gallen, Standort Uznach"]
[8309,"Benin",{"$nulls":11},54441276,"Sprachheilschule Toggenburg, Wattwil"]
[8503,"Bhutan",{"$nulls":11},74317497,"tipiti Oberstufensonderschule Wil"]
[8405,"Bolivien"]
[8252,"Bosnien und Herzegowina"]
[8307,"Botsuana"]
[8406,"Brasilien"]
[8504,"Brunei Darussalam"]
[8205,"Bulgarien"]
[8337,"Burkina Faso"]
[8308,"Burundi"]
[8319,"Cabo Verde"]
[8407,"Chile"]
[8508,"China"]
[8682,"Cookinseln"]
[8408,"Costa Rica"]
[8310,"Côte d'Ivoire"]
[8206,"Dänemark"]
[8440,"Dominica"]
[8409,"Dominikanische Republik"]
[8303,"Dschibuti"]
[8410,"Ecuador"]
[8411,"El Salvador"]
[8362,"Eritrea"]
[8260,"Estland"]
[8352,"Eswatini"]
[8602,"Fidschi"]
[8211,"Finnland"]
[8212,"Frankreich"]
[8311,"Gabun"]
[8312,"Gambia"]
[8562,"Georgien"]
[8313,"Ghana"]
[8441,"Grenada"]
[8214,"Griechenland"]
[8415,"Guatemala"]
[8315,"Guinea"]
[8314,"Guinea-Bissau"]
[8417,"Guyana"]
[8418,"Haiti"]
[8420,"Honduras"]
[8510,"Indien"]
[8511,"Indonesien"]
[8512,"Irak"]
[8513,"Iran"]
[8216,"Irland"]
[8217,"Island"]
[8514,"Israel"]
[8218,"Italien"]
[8421,"Jamaika"]
[8515,"Japan"]
[8516,"Jemen"]
[8517,"Jordanien"]
[8518,"Kambodscha"]
[8317,"Kamerun"]
[8423,"Kanada"]
[8563,"Kasachstan"]
[8519,"Katar"]
[8320,"Kenia"]
[8564,"Kirgisistan"]
[8616,"Kiribati"]
[8424,"Kolumbien"]
[8321,"Komoren"]
[8322,"Kongo (Brazzaville)"]
[8323,"Kongo (Kinshasa)"]
[8530,"Korea (Nord-)"]
[8539,"Korea (Süd-)"]
[8256,"Kosovo"]
[8250,"Kroatien"]
[8425,"Kuba"]
[8521,"Kuwait"]
[8522,"Laos"]
[8324,"Lesotho"]
[8261,"Lettland"]
[8523,"Libanon"]
[8325,"Liberia"]
[8326,"Libyen"]
[8262,"Litauen"]
[8223,"Luxemburg"]
[8327,"Madagaskar"]
[8329,"Malawi"]
[8525,"Malaysia"]
[8526,"Malediven"]
[8330,"Mali"]
[8224,"Malta"]
[8331,"Marokko"]
[8617,"Marshallinseln"]
[8332,"Mauretanien"]
[8333,"Mauritius"]
[8427,"Mexiko"]
[8618,"Mikronesien"]
[8263,"Moldova"]
[8226,"Monaco"]
[8528,"Mongolei"]
[8254,"Montenegro"]
[8334,"Mosambik"]
[8505,"Myanmar"]
[8351,"Namibia"]
[8604,"Nauru"]
[8529,"Nepal"]
[8607,"Neuseeland"]
[8429,"Nicaragua"]
[8227,"Niederlande"]
[8335,"Niger"]
[8336,"Nigeria"]
[8255,"Nordmazedonien"]
[8228,"Norwegen"]
[8527,"Oman"]
[8229,"Österreich"]
[8533,"Pakistan"]
[8550,"Palästina"]
[8619,"Palau"]
[8430,"Panama"]
[8608,"Papua-Neuguinea"]
[8431,"Paraguay"]
[8432,"Peru"]
[8534,"Philippinen"]
[8230,"Polen"]
[8231,"Portugal"]
[8341,"Ruanda"]
[8232,"Rumänien"]
[8264,"Russland"]
[8614,"Salomoninseln"]
[8343,"Sambia"]
[8612,"Samoa"]
[8233,"San Marino"]
[8344,"São Tomé und Príncipe"]
[8535,"Saudi-Arabien"]
[8234,"Schweden"]
[8345,"Senegal"]
[8248,"Serbien"]
[8346,"Seychellen"]
[8347,"Sierra Leone"]
[8340,"Simbabwe"]
[8537,"Singapur"]
[8243,"Slowakei"]
[8251,"Slowenien"]
[8348,"Somalia"]
[8236,"Spanien"]
[8506,"Sri Lanka"]
[8445,"St. Kitts und Nevis"]
[8443,"St. Lucia"]
[8444,"St. Vincent und die Grenadinen"]
[8349,"Südafrika"]
[8350,"Sudan"]
[8363,"Südsudan"]
[8435,"Suriname"]
[8541,"Syrien"]
[8565,"Tadschikistan"]
[8507,"Taiwan (Chinesisches Taipei)"]
[8353,"Tansania"]
[8542,"Thailand"]
[8547,"Timor-Leste"]
[8354,"Togo"]
[8610,"Tonga"]
[8436,"Trinidad und Tobago"]
[8356,"Tschad"]
[8244,"Tschechien"]
[8357,"Tunesien"]
[8239,"Türkei"]
[8566,"Turkmenistan"]
[8615,"Tuvalu"]
[8358,"Uganda"]
[8265,"Ukraine"]
[8240,"Ungarn"]
[8437,"Uruguay"]
[8567,"Usbekistan"]
[8605,"Vanuatu"]
[8241,"Vatikanstadt"]
[8438,"Venezuela"]
[8532,"Vereinigte Arabische Emirate"]
[8439,"Vereinigte Staaten"]
[8215,"Vereinigtes Königreich"]
[8545,"Vietnam"]
[8372,"Westsahara"]
[8360,"Zentralafrikanische Republik"]
[8242,"Zypern"]
[8998,"Staatenlos"]
[8999,"Unbekannt oder nicht angegebener Staat"]